program: Gaussian 09
title: 000145690
version: EM64L-G09RevD.01
frameworkgroup: C1[X(C12H7N3O2)]
method: RPBEPBE
basis: SDD
operation: Freq
keyword: #p
keyword: freq=noraman
keyword: PBEPBE/SDD
title: #p freq=noraman PBEPBE/SDD
converged: NO YES YES YES
title: Mulliken charges:
elementType: O O N N N C C C C C C C C C C C C H H H H H H H
charge: -0.201423 -0.196142 0.001210 0.007987 0.022173 0.109734 0.027768 0.049121 0.063948 -0.487316 -0.289731 0.414537 -0.363614 -0.318466 -0.323470 -0.213174 -0.210626 0.317224 0.272959 0.293154 0.270607 0.269247 0.242367 0.241929
chargesum: 0.00000
title: Mulliken charges with hydrogens summed into heavy atoms:
elementType: O O N N N C C C C C C C C C C C C
charge: -0.201423 -0.196142 0.001210 0.007987 0.022173 0.109734 0.027768 0.049121 0.063948 -0.170093 -0.016772 0.414537 -0.070460 -0.047859 -0.054223 0.029192 0.031303
polarizability: 3.38184573e+02 -1.39057341e+01 1.59207117e+02 -3.81151064e-03 -3.04373002e-03 5.73655453e+01
1716.lowfreq: -10.0313 -8.5184 -0.0009 -0.0007 -0.0002 3.4330 51.2961 59.4741 107.4395
frequency: 51.2875 59.4707 107.4395 144.1656 160.7723 258.2885 259.9572 298.7796 308.4896 399.6338 429.9785 456.9767 485.7135 487.0207 512.4127 518.4298 543.6998 586.6799 598.0111 615.4610 678.7531 707.4580 718.1129 758.7862 767.7262 777.8308 805.5274 828.3782 859.4593 883.7271 889.7187 942.7666 944.8065 980.2588 1002.1461 1002.2186 1004.2953 1058.3118 1116.7591 1131.6932 1160.0959 1204.4619 1216.0134 1231.9200 1248.0013 1264.9017 1277.0453 1350.8308 1361.6238 1377.0103 1403.2196 1438.2144 1458.9894 1474.9307 1499.4191 1528.0236 1551.7872 1599.1558 1634.1891 3141.1545 3153.8974 3166.8940 3168.8423 3177.9737 3188.7624 3193.0380
redmass: 12.1066 7.1148 4.4581 8.5542 6.1770 4.9729 6.7589 9.6917 6.2363 4.1256 6.1394 7.5933 4.2834 2.9997 4.2536 6.8604 7.9371 4.5314 8.7436 7.9731 7.5999 5.7046 6.7589 3.4173 10.1466 1.3069 2.5418 5.2208 1.8287 6.2556 1.7488 5.0839 1.5362 1.3441 2.1894 1.3141 1.3359 2.2796 1.6051 1.4184 1.1508 3.8546 2.1500 3.4246 3.5662 2.4860 2.4950 2.2808 3.4773 6.6918 5.7883 3.6757 3.6652 3.7611 8.5882 7.0780 8.7169 6.1874 7.0909 1.0864 1.0893 1.0897 1.0962 1.1007 1.0929 1.0967
irintensity: 0.0151 0.0428 2.6158 0.3673 5.0827 0.2350 4.9472 1.5986 0.5956 7.4572 0.1856 1.4530 0.7217 0.0296 0.0324 2.8935 5.0138 0.0566 1.0778 3.0985 11.6112 31.0191 0.0267 0.1747 46.0242 111.1286 3.2008 8.3785 32.3037 1.1360 0.2833 1.1249 24.8540 1.8531 5.9365 0.2871 0.0001 36.3586 0.0828 20.5968 4.5191 300.0708 86.1685 18.8223 27.5541 7.9899 3.7599 9.2591 9.3901 89.4744 8.9658 25.6926 20.3888 13.7455 4.4380 23.5010 1.7551 30.1561 8.3406 3.3718 4.6958 4.7525 8.7316 27.7486 5.1501 3.9004
temp: 298.150 k
press: 1.00000 atm
elementType: 8 8 7 7 7 6 6 6 6 6 6 6 6 6 6 6 6 1 1 1 1 1 1 1
symmnumber: 1
zpe: 440296.3 jmol-1
zpe.correction: 0.167700 hartree
zpe.thermalcorrener: 0.179791 hartree
zpe.thermalcorrenthalpy: 0.180735 hartree
zpe.thermalcorrgfe: 0.128636 hartree
zpe.sumelectzpe: -774.947098 hartree
zpe.sumelectthermal: -774.935007 hartree
zpe.sumelectthermalent: -774.934063 hartree
zpe.sumelectthermalfe: -774.986162 hartree
dipole: 6.2710 1.3486 0.0011
dipole: 6.4144
quadrupole: -100.6157 -95.0708 -98.4501
quadrupole: -9.4005 -0.0069 -0.0003
quadrupole: -2.5701 2.9747 -0.4046 -9.4005 -0.0069 -0.0003
hfenergy: -775.1147981 hartree
pointgroup: C01 [X(C12H7N3O2)]
dipole: 2.4652449 0.5395959 0.0004163 debye
dipolederiv: -0.9754651 0.1979051 0.0000286 0.1231596 -0.5594366 -0.000088 -0.0003093 0.0002233 -0.2266685 -0.715637 -0.1445452 -0.0000363 -0.3875422 -0.73697 0.0002352 -0.0002138 -0.0002295 -0.2198925 0.0666654 0.0355772 -0.000025 -0.0798223 -0.1852136 0.0000031 -0.0000784 -0.0000137 -0.2670452 -0.3339465 0.049553 -0.0000126 0.0096011 -0.1718711 -0.000005 0.0000136 -0.0000027 -0.264818 2.1230296 0.0348816 0.0001318 0.4575479 1.0885681 -0.0001245 0.0002226 -0.0000611 0.1901052 -0.1274363 -0.1698578 0.000023 0.2376464 -0.0851109 0.000003 -0.0000127 0.0000177 0.1165107 0.2883738 -0.008036 0.0000043 -0.2604186 -0.0102605 0.0000214 0.0000102 0.0000059 0.1202158 -0.0214562 -0.0104515 0.0000066 -0.5771546 -0.0279509 0.0000324 0.0000569 0.0000088 0.1389795 0.4014564 -0.1440384 -0.0000017 0.4747564 -0.0895042 -0.0000144 -0.0000272 0.0000177 0.1372593 0.4488492 0.1292746 -0.000036 -0.1250643 -0.0433562 -0.0000306 0.0001865 0.0000136 -0.1055473 -0.221805 0.0476648 -0.0000124 -0.0552314 0.1731901 -0.0000209 0.0000505 -0.0000255 -0.1343993 -0.9327085 -0.0248004 -0.0000833 0.0755133 0.1094754 -0.0000205 0.0000335 0.0000431 0.0646852 -0.0470023 -0.1248786 -0.000011 0.1086243 -0.0004546 0.0000163 0.0001033 -0.0000062 -0.1245244 -0.0875298 0.0345389 -0.0000053 -0.0632713 0.1225713 -0.0000133 0.0000024 -0.0000112 -0.1597856 -0.2747961 0.100907 -0.000006 0.1353668 0.1036074 -0.0000156 -0.0000075 -0.0000202 -0.1674806 -0.0236702 -0.1604765 0.0000009 -0.2458646 0.0801574 0.0000047 -0.0000015 0.0000015 -0.1354306 0.1316432 0.1291199 -0.0000205 0.1634394 0.0464688 -0.0000198 -0.0000237 -0.0000144 -0.1276967 0.1206479 0.0022998 0.0000075 -0.0157148 0.0829861 0.000007 0.0000092 -0.0000005 0.1770034 0.0774857 -0.0434164 -0.0000007 0.0162578 -0.0224225 0.0000046 -0.0000405 0.0000128 0.1590307 0.0841763 0.0731308 0.000011 0.0091665 0.1018817 -0.0000016 -0.0000132 0.0000133 0.1757206 0.0879917 -0.0474089 0.0000069 0.0288963 -0.0313752 0.0000073 0.0000038 0.0000117 0.1663651 0.0780554 0.0107273 0.000005 -0.0679459 -0.0317895 0.0000117 0.0000058 0.0000085 0.1661859 -0.0492037 0.0983491 0.0000075 0.1027301 0.0169827 0.0000001 0.0000088 -0.000001 0.1611626 -0.0977178 -0.0660194 0.0000176 -0.0646759 0.0698269 0.0000073 0.0000209 0.0000082 0.1600648 unknown
polarizability: 338.2840306|-13.2498645|159.1076594|-0.0038003|-0.0030577|57.3655453 unknown
InChI: InChI=1S/C12H7N3O2/c16-15(17)8-5-6-11-12(7-8)14-10-4-2-1-3-9(10)13-11/h1-7H
charge 0 multiplicity 1
24 atoms
O  -5.057704 0.34051 -0.000487
O  -4.269264 -1.80014 -0.000168
N  0.732945 -1.293739 0.000073
N  1.178248 1.578064 -0.000069
N  -4.095616 -0.521889 0.000321
C  -0.308337 -0.400367 0.000103
C  -0.084498 1.047114 0.000029
C  1.995845 -0.763566 -0.000029
C  2.221549 0.687248 -0.0001
C  -1.648975 -0.905547 0.0002
C  -1.219399 1.930527 0.000046
C  -2.703741 0.000068 0.000235
C  -2.511271 1.424133 0.000139
C  3.127583 -1.649283 -0.000061
C  3.568366 1.184472 -0.0002
C  4.417857 -1.129127 -0.00016
C  4.639019 0.294975 -0.000231
H  -1.821973 -1.984349 0.000272
H  -1.023789 3.00658 -0.00001
H  -3.390565 2.072437 0.000145
H  2.931615 -2.725668 -0.000003
H  3.711146 2.269172 -0.000253
H  5.280792 -1.803313 -0.000184
H  5.666166 0.674986 -0.000309
