program: Gaussian 09
title: 000010004
version: EM64L-G09RevD.01
frameworkgroup: C1[X(C3H5FO2)]
method: RPBEPBE
basis: SDD
operation: Freq
keyword: #pfreq=noraman
keyword: PBEPBE/SDD
title: #p freq=noraman PBEPBE/SDD
converged: NO YES NO NO
title: Mulliken charges:
elementType: F O O C C C H H H H H
charge: -0.240240 -0.409524 -0.235264 -0.480558 -0.189743 0.226751 0.273594 0.239772 0.204327 0.229691 0.381194
chargesum: 0.00000
title: Mulliken charges with hydrogens summed into heavy atoms:
elementType: F O O C C C
charge: -0.240240 -0.028331 -0.235264 0.032809 0.244275 0.226751
polarizability: 4.31801709e+01 -1.85966602e-01 3.99782293e+01 -4.64451414e+00 4.76653996e-01 3.15828913e+01
1716.lowfreq: -5.6914 -4.3437 0.0011 0.0011 0.0013 9.8434 46.6354 97.2894 235.9447
frequency: 46.5701 97.2890 235.9431 345.8444 470.3174 505.5990 592.2966 658.4998 789.0754 837.4637 983.4143 1016.7142 1046.1343 1101.5334 1183.4227 1222.3882 1267.5379 1375.0973 1383.5254 1422.6652 1461.4478 1671.3837 3001.6006 3030.0977 3090.2617 3106.9112 3513.6595
redmass: 5.5479 6.0457 2.8334 2.7686 4.0509 2.2965 2.7674 1.4818 3.2194 3.2144 3.1805 1.8021 2.7259 2.2182 1.1303 1.1762 1.7050 1.4949 1.5127 1.0911 1.0866 8.3899 1.0653 1.0578 1.0976 1.1078 1.0639
irintensity: 2.8946 3.2188 6.4172 1.1851 45.9321 28.1064 23.2099 140.6330 2.4258 15.4180 42.8310 19.6271 159.1175 116.0700 5.1734 8.1872 3.2267 41.3526 32.9505 33.5091 12.3803 218.6465 4.3914 42.5221 3.8245 20.0146 25.1491
temp: 298.150 k
press: 1.00000 atm
elementType: 9 8 8 6 6 6 1 1 1 1 1
symmnumber: 1
zpe: 212078.1 jmol-1
zpe.correction: 0.080776 hartree
zpe.thermalcorrener: 0.087181 hartree
zpe.thermalcorrenthalpy: 0.088126 hartree
zpe.thermalcorrgfe: 0.049655 hartree
zpe.sumelectzpe: -367.127863 hartree
zpe.sumelectthermal: -367.121458 hartree
zpe.sumelectthermalent: -367.120514 hartree
zpe.sumelectthermalfe: -367.158985 hartree
dipole: 0.9292 -1.7811 2.0476
dipole: 2.8685
quadrupole: -31.2151 -38.7643 -33.5559
quadrupole: 0.7427 -6.1926 -1.4554
quadrupole: 3.2967 -4.2526 0.9559 0.7427 -6.1926 -1.4554
hfenergy: -367.2086392 hartree
pointgroup: C01 [X(C3H5F1O2)]
dipole: -0.4235208 0.983719 0.3557397 debye
dipolederiv: -0.4327198 0.0905869 0.0903983 0.1511412 -0.3956082 -0.1568992 0.1823993 -0.1890474 -0.5174895 -0.9787688 0.2522646 -0.4373053 0.142623 -0.3379306 0.0257607 -0.3949078 0.064622 -0.6664032 -0.5886858 -0.1278127 -0.0326131 0.0599937 -0.7647697 0.344015 -0.1796141 0.2424839 -0.5795513 -0.2687719 -0.0530416 -0.0273482 -0.1246322 -0.1899667 0.0171563 -0.1107685 0.0444517 0.0445311 0.5681586 -0.08474 -0.1178508 -0.139637 0.4721167 0.1786232 -0.1088941 0.188659 0.5844692 1.2679113 0.1020663 0.4651515 0.0832811 0.9488953 -0.4861876 0.5457605 -0.4208423 0.7918738 0.061393 -0.0022974 -0.0176701 -0.0044234 0.0903524 0.064879 -0.0133036 0.0925528 -0.0082558 0.0565853 0.0147218 0.0469319 0.0087742 0.0421908 -0.078474 0.039668 -0.1050879 0.0265067 -0.0711921 -0.1042306 -0.0136617 -0.1056718 -0.0578356 -0.0806436 0.0164028 -0.0427043 0.0402936 0.1028457 0.0149527 0.0306085 0.0606041 0.0059732 0.0911816 -0.0018777 0.0296258 -0.0655163 0.2832445 -0.10247 0.0133588 -0.1320531 0.1865824 0.0805886 0.0251352 0.0952866 0.3495416 unknown
polarizability: 43.2697256|2.4419975|37.7205161|3.8567452|-3.7427307|33.7510497 unknown
InChI: InChI=1S/C3H5FO2/c4-2-1-3(5)6/h5H,1-2H2
charge 0 multiplicity 1
11 atoms
F  1.984523 -0.333035 -0.818256
O  -2.009273 0.273532 -0.606005
O  -0.890326 -1.078616 0.915917
C  0.172498 1.001893 0.100892
C  1.564047 0.429956 0.359644
C  -0.91484 -0.055905 0.198762
H  0.125409 1.495737 -0.883317
H  -0.051287 1.774489 0.864409
H  2.307823 1.233487 0.501139
H  1.563482 -0.270322 1.212735
H  -2.716757 -0.420416 -0.505619
