program: Gaussian 09
title: 000145706
version: EM64L-G09RevD.01
frameworkgroup: C1[X(C16H14O5)]
method: RPBEPBE
basis: SDD
operation: Freq
keyword: #pfreq=noraman
keyword: PBEPBE/SDD
title: #p freq=noraman PBEPBE/SDD
converged: YES YES NO NO
title: Mulliken charges:
elementType: O O O O O C C C C C C C C C C C C C C C C H H H H H H H H H H H H H H
charge: -0.278667 -0.275247 -0.252747 -0.263262 -0.259735 0.059660 0.192210 0.245182 0.185177 0.104967 0.260514 -0.573028 -0.504070 0.380111 -0.541782 -0.358741 0.329130 -0.344031 -0.524788 -0.534228 -0.537080 0.278440 0.301858 0.282294 0.257669 0.249272 0.292011 0.205860 0.229027 0.227791 0.250261 0.225688 0.220856 0.219891 0.249537
chargesum: 0.00000
title: Mulliken charges with hydrogens summed into heavy atoms:
elementType: O O O O O C C C C C C C C C C C C C C C C
charge: -0.278667 -0.275247 -0.252747 -0.263262 -0.259735 0.059660 0.192210 0.245182 0.185177 0.104967 0.260514 -0.294587 -0.202212 0.380111 -0.259488 -0.101072 0.329130 -0.094759 0.202111 0.169512 0.153204
polarizability: 3.32959488e+02 6.28074465e+00 2.20165974e+02 1.13066955e+00 -5.89934093e+00 9.18340778e+01
1716.lowfreq: -7.7048 -2.2120 0.0006 0.0007 0.0007 5.7643 33.6045 40.9099 77.9307
frequency: 33.5968 40.8992 77.9291 85.2249 101.5744 114.8194 129.2875 141.5679 176.6557 179.1550 200.4545 223.6415 232.2433 236.1041 255.9754 271.0425 291.7091 312.4774 324.5039 357.1031 377.4528 399.1562 440.2064 446.7412 503.2932 529.8573 534.8673 551.0993 556.4674 586.0027 602.0070 635.2607 674.1800 679.2488 699.0114 723.2702 735.6083 795.7211 811.6809 830.0885 837.7671 866.4837 874.2068 921.2488 932.7508 940.1832 951.4939 1000.0620 1022.0396 1043.1617 1097.2548 1105.8370 1111.1801 1112.0937 1132.1861 1138.3479 1154.1760 1159.0978 1164.7898 1187.5965 1199.4623 1241.0119 1253.4062 1273.3156 1292.8430 1373.1119 1399.1823 1410.7206 1422.7825 1432.1458 1436.8186 1437.5908 1450.7313 1463.7443 1466.7610 1467.7012 1468.7033 1471.8581 1476.0041 1489.5221 1538.1784 1562.2437 1587.2167 1621.6610 1636.0920 2957.2973 2968.1319 2979.0399 3045.0081 3059.8290 3092.0211 3124.6220 3127.0977 3132.5417 3156.2150 3174.0402 3176.1082 3188.2598 3191.9680
redmass: 4.6173 4.2661 3.0249 3.2970 2.1658 4.5710 2.6817 2.5076 4.0544 3.6840 1.6233 4.2681 1.4295 2.4299 2.5140 4.1874 5.6418 5.2759 6.3760 4.6550 6.0257 6.4953 3.5307 5.9297 8.1872 6.3496 5.8599 4.9807 4.7492 5.4577 4.8777 3.7681 6.6243 3.9192 6.0013 3.6865 6.4007 4.2355 1.5645 1.6196 7.0630 3.9187 2.1933 1.4967 6.5820 1.3577 8.4302 3.6406 3.1913 4.2984 3.1045 1.2506 1.2587 1.2591 1.5574 1.6755 1.4486 1.5839 1.4741 2.0794 1.8703 1.8894 5.6190 2.9767 4.1801 4.7732 6.9139 2.3303 1.6919 1.8353 2.0165 1.4831 1.1852 2.4862 1.0521 1.0731 1.5843 1.0869 1.4399 1.0899 7.7037 7.8363 8.1876 7.3173 7.8799 1.0332 1.0326 1.0318 1.1040 1.1043 1.1003 1.1051 1.0990 1.1001 1.0877 1.0925 1.0961 1.0917 1.0925
irintensity: 2.3716 0.8410 1.9758 9.2560 2.0400 0.8304 0.7730 2.8533 1.6746 1.0465 3.3729 2.4499 0.8776 3.9532 2.5928 5.8017 10.8626 0.6843 2.8630 8.0903 0.1582 5.1120 1.5375 3.4081 4.5924 9.5957 3.8061 14.5977 25.5531 10.5459 1.5134 6.9929 0.0951 4.3440 1.4016 7.4806 40.1229 1.6844 53.7533 28.4285 5.9806 5.2633 51.8508 11.1406 9.8459 6.2057 38.5487 36.0275 87.2761 98.4774 37.7870 13.5863 0.1746 0.1382 101.8446 59.3666 40.9117 35.8628 109.5566 143.0038 76.1833 6.7230 0.2329 392.2540 9.5806 64.7156 39.0937 15.1730 71.3647 119.1641 39.4584 43.6105 20.3418 35.8085 15.8296 26.5364 212.7159 49.8209 55.4111 71.0460 197.7623 213.7175 137.8960 328.2486 164.0270 82.0879 62.1296 75.0300 49.6043 41.7529 32.2887 11.3364 24.2971 23.5326 6.5606 1.0128 12.8871 0.7679 0.0398
temp: 298.150 k
press: 1.00000 atm
elementType: 8 8 8 8 8 6 6 6 6 6 6 6 6 6 6 6 6 6 6 6 6 1 1 1 1 1 1 1 1 1 1 1 1 1 1
symmnumber: 1
zpe: 693200.8 jmol-1
zpe.correction: 0.264026 hartree
zpe.thermalcorrener: 0.283019 hartree
zpe.thermalcorrenthalpy: 0.283964 hartree
zpe.thermalcorrgfe: 0.216816 hartree
zpe.sumelectzpe: -992.680330 hartree
zpe.sumelectthermal: -992.661336 hartree
zpe.sumelectthermalent: -992.660392 hartree
zpe.sumelectthermalfe: -992.727539 hartree
dipole: 1.4073 -5.5361 2.3215
dipole: 6.1659
quadrupole: -92.8992 -111.4878 -124.6188
quadrupole: 0.0666 -0.9108 6.2239
quadrupole: 16.7694 -1.8192 -14.9502 0.0666 -0.9108 6.2239
hfenergy: -992.9443558 hartree
pointgroup: C01 [X(C16H14O5)]
dipole: 0.6293071 2.1715946 -0.8791042 debye
polarizability: 332.3227964|-10.4114559|220.9454971|-2.704368|-3.575538|91.6912464 unknown
InChI: InChI=1S/C16H14O5/c1-18-9-4-5-12-11(6-9)16(17)15-13(20-3)7-10(19-2)8-14(15)21-12/h4-8H,1-3H3
charge 0 multiplicity 1
35 atoms
O  -0.040772 1.685512 -0.178321
O  -2.515438 -2.655438 0.064179
O  -4.852718 1.426735 0.138145
O  0.426833 -2.424691 0.504062
O  5.097513 -0.559181 0.057431
C  -1.08278 -0.569607 0.010452
C  1.415411 -0.28511 0.059397
C  -1.173892 0.860094 -0.074857
C  1.238953 1.106582 -0.14351
C  0.243129 -1.197332 0.203285
C  -2.351269 -1.271928 0.046614
C  -2.383194 1.578156 -0.043128
C  2.73024 -0.798343 0.126318
C  -3.585184 0.848631 0.077783
C  -3.564967 -0.565773 0.105696
C  2.336688 1.975266 -0.287792
C  3.840043 0.05803 -0.019277
C  3.643227 1.453493 -0.229346
C  -1.792038 -3.512314 -0.900536
C  -4.940007 2.890724 0.080889
C  6.282553 0.291174 -0.075737
H  -2.342745 2.667249 -0.100291
H  2.870678 -1.869845 0.294037
H  -4.502487 -1.124393 0.141463
H  2.159321 3.043872 -0.438758
H  4.492923 2.132583 -0.343244
H  -0.78455 -3.736362 -0.518586
H  -1.730712 -3.016142 -1.887734
H  -2.407742 -4.422195 -0.973985
H  -4.406223 3.355273 0.931701
H  -6.014159 3.115031 0.147287
H  -4.534091 3.278075 -0.8731
H  6.324902 1.053999 0.726283
H  6.31494 0.78809 -1.065224
H  7.137113 -0.394014 0.021104
