program: Gaussian 09
title: 000145686
version: EM64L-G09RevD.01
frameworkgroup: C1[X(C3H3Cl3O)]
method: RPBEPBE
basis: SDD
operation: Freq
keyword: #p
keyword: freq=noraman
keyword: PBEPBE/SDD
title: #p freq=noraman PBEPBE/SDD
converged: NO YES NO NO
title: Mulliken charges:
elementType: Cl Cl Cl O C C C H H H
charge: 0.016988 0.085215 0.031566 -0.414529 -0.333110 0.167474 -0.372351 0.218445 0.253082 0.347219
chargesum: 0.00000
title: Mulliken charges with hydrogens summed into heavy atoms:
elementType: Cl Cl Cl O C C C
charge: 0.016988 0.085215 0.031566 -0.067310 0.138417 0.167474 -0.372351
polarizability: 8.26947568e+01 3.78931687e+00 7.72207200e+01 2.69681922e+00 -1.94156147e+00 3.37053040e+01
1716.lowfreq: -6.9296 0.0023 0.0024 0.0036 2.4117 8.5371 55.4658 83.7636 176.1942
frequency: 55.4530 83.7590 176.1937 192.8251 249.1856 285.0105 328.0652 361.7827 378.5725 469.6909 606.0115 689.4802 828.0359 927.5605 994.7440 1082.6995 1178.5777 1312.5702 1372.1385 1448.9188 1620.6515 3009.4059 3089.9270 3559.2255
redmass: 4.5071 8.7365 16.5582 7.8167 5.3994 2.2919 6.8111 2.2861 5.9222 6.8293 7.9364 6.7498 10.6375 2.6479 2.7595 5.0331 1.1469 1.2049 1.1758 1.0750 9.7847 1.0622 1.1005 1.0666
irintensity: 3.1667 0.6333 1.8353 0.3978 10.5466 52.6113 24.0160 53.4556 19.4174 17.2278 20.3026 66.5606 128.5300 101.9395 9.5670 45.5072 14.3259 18.1243 22.4561 10.4794 30.4040 25.6469 6.7850 10.8758
temp: 298.150 k
press: 1.00000 atm
elementType: 17 17 17 8 6 6 6 1 1 1
symmnumber: 1
zpe: 145349.2 jmol-1
zpe.correction: 0.055361 hartree
zpe.thermalcorrener: 0.063697 hartree
zpe.thermalcorrenthalpy: 0.064641 hartree
zpe.thermalcorrgfe: 0.020553 hartree
zpe.sumelectzpe: -1570.921815 hartree
zpe.sumelectthermal: -1570.913478 hartree
zpe.sumelectthermalent: -1570.912534 hartree
zpe.sumelectthermalfe: -1570.956623 hartree
dipole: 0.8319 1.2695 0.1290
dipole: 1.5233
quadrupole: -69.5146 -59.8825 -57.9281
quadrupole: 0.0147 0.6599 0.5390
quadrupole: -7.0728 2.5592 4.5136 0.0147 0.6599 0.5390
hfenergy: -1570.9771756 hartree
pointgroup: C01 [X(C3H3Cl3O1)]
dipole: 0.1994823 0.5618275 0.0609971 debye
dipolederiv: -0.1389681 -0.1078325 -0.0186414 -0.2048626 -0.611067 -0.0025571 -0.0351428 0.0130097 -0.0215031 -0.5381385 0.2595844 -0.0825607 0.354828 -0.3401743 0.063554 -0.1285737 0.0657553 0.0411858 -0.1939896 -0.115598 -0.0237466 -0.1581662 -0.7302423 0.0217637 -0.02879 0.0140484 0.0163354 -0.6420917 0.1735808 0.2308757 0.2291359 -0.4807559 0.0917124 0.3654895 0.0398937 -0.4426033 0.5766762 -0.1037021 -0.2020908 -0.290528 0.1567791 -0.0255248 -0.2632326 0.0179442 0.4967042 -0.1688713 0.1918203 0.0828573 0.425269 0.5942278 0.0388272 -0.0105214 0.0185345 -0.1359758 0.869339 -0.1391472 0.146431 -0.2095397 1.0826767 -0.1158999 0.1976203 -0.094708 -0.1171111 0.0239166 -0.0587408 0.0804037 -0.0336536 -0.1061877 0.0538902 0.0453103 0.0060207 0.0601907 -0.0207329 -0.0053443 -0.0728995 0.0026658 0.1027583 -0.0637403 -0.0048492 -0.0338035 -0.0315957 0.2328601 -0.0946206 -0.1406287 -0.1151486 0.3319853 -0.0620254 -0.1373104 -0.046695 0.1343729 unknown
polarizability: 80.5125547|4.6019076|79.2772095|4.086496|-0.6609288|33.8310166 unknown
InChI: InChI=1S/C3H3Cl3O/c4-2(1-7)3(5)6/h7H,1H2
charge 0 multiplicity 1
10 atoms
Cl -0.659242 -2.017011 -0.180584
Cl 2.408231 -0.955805 0.258871
Cl 1.492061 1.90247 -0.026944
O  -2.486807 0.521059 0.584458
C  -1.455115 0.653968 -0.44866
C  -0.259849 -0.245699 -0.210798
C  1.025244 0.149576 -0.021248
H  -1.111291 1.700601 -0.55335
H  -1.963812 0.350461 -1.378111
H  -2.10782 0.773478 1.464868
