program: Gaussian 09
title: 000145684
version: EM64L-G09RevD.01
frameworkgroup: C1[X(C16H30O)]
method: RPBEPBE
basis: SDD
operation: Freq
keyword: #pfreq=noraman
keyword: PBEPBE/SDD
title: #p freq=noraman PBEPBE/SDD
converged: YES YES NO NO
title: Mulliken charges:
elementType: O C C C C C C C C C C C C C C C C H H H H H H H H H H H H H H H H H H H H H H H H H H H H H H
charge: -0.220684 -0.390104 -0.389465 -0.380852 -0.410789 -0.381710 -0.382742 -0.374345 -0.371684 -0.352603 -0.408502 -0.357548 -0.474427 -0.699312 -0.110729 -0.240089 -0.108328 0.195589 0.208054 0.198959 0.192188 0.187965 0.184933 0.193009 0.197457 0.221736 0.184903 0.189843 0.206332 0.188892 0.181187 0.216616 0.197867 0.180366 0.208336 0.202553 0.206947 0.195079 0.189764 0.226066 0.215656 0.207656 0.210940 0.213893 0.223949 0.262670 0.164506
chargesum: 0.00000
title: Mulliken charges with hydrogens summed into heavy atoms:
elementType: O C C C C C C C C C C C C C C C C
charge: -0.220684 0.013539 0.001682 -0.007954 -0.020322 0.024929 0.013433 -0.004266 0.042799 0.036099 0.000999 0.027295 -0.032706 -0.066823 0.113221 0.022581 0.056178
polarizability: 2.37450709e+02 -8.68027071e+00 1.59718826e+02 2.64932143e+00 3.82201902e+00 1.41235030e+02
1716.lowfreq: -12.2854 -5.2065 -0.0006 0.0003 0.0007 4.0312 15.2632 17.4901 33.4907
frequency: 12.4795 17.1697 33.3978 39.8621 54.5201 56.2000 69.1266 91.7778 98.7078 128.7855 133.3526 141.1942 146.6604 147.9012 174.7990 187.1391 200.5663 239.7749 243.5923 266.3806 274.6536 291.3645 336.9452 395.6349 419.7675 442.9725 452.3974 480.1792 514.7767 551.6700 708.7514 722.9094 727.8099 745.2432 768.5196 786.6608 803.9271 828.3779 855.1675 879.7237 885.8626 890.2828 921.8873 943.2502 968.4100 976.5125 992.8663 1000.0381 1007.1001 1018.1758 1021.9554 1047.4063 1057.5642 1074.6726 1078.8630 1082.3110 1089.6223 1111.5967 1113.7612 1123.1040 1144.2221 1150.5197 1178.0841 1186.9063 1209.1421 1219.1030 1233.3254 1250.7849 1255.8686 1260.4280 1275.5544 1279.3647 1280.6961 1285.4807 1288.3696 1291.0636 1294.7704 1303.3500 1311.1693 1325.1559 1331.6332 1342.2653 1346.1447 1352.5199 1355.2674 1357.0423 1361.9681 1378.8067 1386.7623 1459.2908 1459.4073 1461.7060 1462.5836 1463.9852 1465.6729 1466.8621 1469.9368 1473.5428 1477.1805 1477.5312 1480.7717 1486.0927 1489.3579 1597.7695 1645.6227 2858.1243 2945.2529 2947.7737 2952.3792 2953.1751 2955.1694 2958.0671 2961.3502 2963.2202 2965.2044 2968.1852 2969.8344 2970.8175 2978.3930 2984.7030 2987.7198 2997.4744 3001.3798 3005.0647 3014.9126 3021.1849 3024.6223 3032.5731 3040.8978 3043.3328 3045.8601 3065.6573 3066.4568 3068.3951 3126.8590
redmass: 4.3408 4.6295 1.9142 5.8221 3.0673 3.1163 2.8839 1.6613 2.6374 3.0260 1.8364 2.4595 2.7008 2.4580 3.5597 2.3399 3.0207 1.0967 2.4940 2.9828 2.2754 2.2935 2.4244 2.5541 3.5336 3.0466 2.5419 2.4023 2.4115 3.4499 1.1865 1.0612 1.0966 1.1699 1.2531 1.5045 1.4476 1.8169 1.4377 2.1929 1.7974 1.8049 1.5805 1.4313 1.6281 2.1832 1.7628 1.2347 2.3118 1.9886 1.7621 2.5021 2.0531 2.2734 2.1003 1.7049 2.0280 2.1245 2.2506 2.3036 2.1315 1.6910 1.4237 1.7200 1.3683 1.4131 1.3576 1.3637 1.3069 1.3624 1.2415 1.0891 1.1735 1.2737 1.1592 1.0898 1.1991 1.1898 1.2364 1.3423 1.3188 1.4230 1.4634 1.5613 1.6117 1.5511 1.4913 1.2577 1.2179 1.0736 1.0748 1.0764 1.0761 1.0738 1.0839 1.0832 1.0967 1.0789 1.0889 1.0426 1.0883 1.0847 1.0949 7.7000 5.5852 1.0849 1.0588 1.0588 1.0595 1.0595 1.0604 1.0611 1.0610 1.0610 1.0610 1.0625 1.0366 1.0629 1.0626 1.0926 1.0965 1.0983 1.1004 1.0993 1.1005 1.1031 1.1005 1.1043 1.1035 1.1019 1.0943 1.0924 1.0999 1.1002 1.0925
irintensity: 0.4395 0.9357 0.1562 2.3579 0.2213 0.5776 2.8990 0.0707 0.2783 0.5706 0.1594 0.5752 2.2935 1.5011 6.0089 0.3826 0.5848 0.0026 1.4338 0.8773 4.5476 0.5942 0.9760 1.2205 0.7910 0.6013 4.4163 1.8501 0.5000 8.7485 8.9803 16.5966 0.6712 6.1225 2.0392 3.5925 1.5001 2.2437 1.9406 0.3229 5.9305 1.5874 13.0817 6.7252 12.5595 0.2863 8.7280 46.2728 1.3900 2.3446 2.8900 2.5648 1.7487 7.4419 0.5525 14.7982 1.6115 2.0738 5.4836 14.5933 9.3024 12.7398 18.1423 1.5039 2.2416 3.6718 4.6386 4.3723 3.1289 0.9602 0.5602 1.2033 3.5520 0.9854 3.2450 0.2065 0.1384 0.9459 1.3835 1.9179 0.7249 1.9359 0.7749 2.7097 0.3060 0.3847 1.8044 7.4410 11.2385 0.9227 4.4908 5.0557 4.5106 1.0280 2.4314 1.6361 23.0994 2.2394 13.8878 11.6433 3.0244 2.6674 22.4009 154.7370 173.4176 105.4736 0.2639 14.2248 6.2469 9.5513 9.1874 2.2968 19.5360 10.9135 155.9997 116.4171 44.0685 35.7917 41.9240 19.4692 1.4229 2.8488 6.2147 8.6112 7.8809 11.1470 46.8707 7.8197 189.4854 152.7191 30.7670 40.8421 84.1192 80.0423 10.6109
temp: 298.150 k
press: 1.00000 atm
elementType: 8 6 6 6 6 6 6 6 6 6 6 6 6 6 6 6 6 1 1 1 1 1 1 1 1 1 1 1 1 1 1 1 1 1 1 1 1 1 1 1 1 1 1 1 1 1 1
symmnumber: 1
zpe: 1111469.6 jmol-1
zpe.correction: 0.423336 hartree
zpe.thermalcorrener: 0.445196 hartree
zpe.thermalcorrenthalpy: 0.446141 hartree
zpe.thermalcorrgfe: 0.368515 hartree
zpe.sumelectzpe: -701.501326 hartree
zpe.sumelectthermal: -701.479466 hartree
zpe.sumelectthermalent: -701.478522 hartree
zpe.sumelectthermalfe: -701.556148 hartree
dipole: 4.7973 -0.1287 0.5764
dipole: 4.8335
quadrupole: -104.2558 -109.3786 -107.0796
quadrupole: 9.9166 0.2618 3.6476
quadrupole: 2.6489 -2.4739 -0.1749 9.9166 0.2618 3.6476
hfenergy: -701.9246622 hartree
pointgroup: C01 [X(C16H30O1)]
dipole: -1.887517 0.0598647 0.2234387 debye
polarizability: 237.2953929|-9.302168|160.1573852|-2.7500141|-3.0935649|140.9517857 unknown
InChI: InChI=1S/C16H30O/c1-2-3-4-5-6-7-8-9-10-11-12-13-14-15-16-17/h14-16H,2-13H2,1H3
charge 0 multiplicity 1
47 atoms
O  1.070227 -2.522207 -0.147948
C  -0.395125 1.889643 -0.318035
C  -1.495355 2.622867 0.483704
C  0.963109 1.841401 0.418421
C  -2.861319 2.72562 -0.243389
C  2.048227 1.053265 -0.349803
C  -3.523196 1.369083 -0.599777
C  3.392935 0.968153 0.406974
C  -3.829789 0.483364 0.631411
C  4.454647 0.127365 -0.337158
C  -4.608458 -0.813258 0.302403
C  5.797014 0.024925 0.422347
C  -3.83599 -1.816747 -0.610247
C  6.853087 -0.813866 -0.330024
C  -2.565185 -2.318304 0.023885
C  -1.30405 -2.17303 -0.485788
C  -0.123782 -2.674046 0.237269
H  -0.265405 2.3861 -1.302946
H  -0.714866 0.849926 -0.532977
H  -1.626774 2.118822 1.463153
H  -1.142708 3.648922 0.716247
H  0.816799 1.377215 1.416946
H  1.317446 2.876898 0.607338
H  -3.562124 3.307997 0.390461
H  -2.724391 3.309992 -1.176742
H  1.684857 0.02423 -0.547875
H  2.21324 1.526033 -1.341141
H  -4.47063 1.566467 -1.14351
H  -2.870361 0.819284 -1.305793
H  3.216427 0.523119 1.408827
H  3.787384 1.991497 0.584216
H  -2.883496 0.220548 1.143974
H  -4.422706 1.077281 1.3571
H  4.636057 0.567144 -1.340754
H  4.050688 -0.891309 -0.510264
H  -4.880071 -1.328415 1.24642
H  -5.561153 -0.555589 -0.202478
H  5.614399 -0.419838 1.422065
H  6.193765 1.045353 0.60364
H  -3.618549 -1.354658 -1.590224
H  -4.504043 -2.682708 -0.801966
H  7.077618 -0.371777 -1.319429
H  7.801565 -0.877717 0.235259
H  6.489099 -1.844787 -0.499768
H  -2.677752 -2.828602 0.996541
H  -1.126296 -1.667276 -1.443832
H  -0.351614 -3.211176 1.195068
