program: Gaussian 09
title: 000145681
version: EM64L-G09RevD.01
frameworkgroup: C1[X(C9H11N3O7)]
method: RPBEPBE
basis: SDD
operation: Freq
keyword: #p
keyword: freq=noraman
keyword: PBEPBE/SDD
title: #p freq=noraman PBEPBE/SDD
converged: YES YES NO NO
title: Mulliken charges:
elementType: O O O O O O O N N N C C C C C C C C C H H H H H H H H H H H
charge: -0.245962 -0.423733 -0.460531 -0.235084 -0.189428 -0.263050 -0.146957 -0.180560 -0.414263 0.043911 -0.128436 -0.005553 -0.533567 -0.051053 -0.375148 -0.144543 0.213845 0.159564 0.151840 0.220931 0.292330 0.237845 0.282698 0.297369 0.199858 0.229937 0.343062 0.362931 0.374089 0.387656
chargesum: 0.00000
title: Mulliken charges with hydrogens summed into heavy atoms:
elementType: O O O O O O O N N N C C C C C C C C C
charge: -0.245962 -0.080671 -0.072874 -0.235084 -0.189428 -0.263050 -0.146957 -0.180560 -0.040174 0.043911 0.092495 0.286777 -0.013024 0.246317 0.054647 0.218388 0.213845 0.159564 0.151840
polarizability: 1.99237418e+02 1.45410181e+01 1.61043974e+02 -3.26482041e+00 3.00559318e-01 8.26148915e+01
1716.lowfreq: -11.7301 -9.2739 -0.0010 -0.0008 -0.0007 6.6969 39.1143 49.9711 67.9949
frequency: 39.0134 49.9322 67.9931 74.1439 103.9379 107.9486 127.8849 163.8084 177.6009 196.3867 214.3322 222.6084 272.4110 296.5635 313.8738 320.5231 332.7242 366.1688 384.9720 427.6939 444.4254 456.1347 477.0888 516.0071 541.5576 593.2962 622.4538 654.8428 706.2071 713.5911 719.2277 732.1938 745.1138 762.6947 782.5466 791.6696 818.5972 856.7586 933.7375 944.0598 973.7613 992.5666 1014.4204 1033.3451 1037.7274 1050.0506 1057.2388 1069.2868 1081.3375 1151.6183 1163.6048 1183.7630 1214.2477 1224.5009 1235.8256 1251.9119 1264.5733 1266.9559 1290.4095 1302.7965 1325.7126 1333.0756 1350.9302 1362.8125 1372.8069 1383.8092 1404.1441 1424.3821 1453.3157 1473.7291 1595.6170 1647.6316 1667.0658 2933.0882 2978.7433 2992.3954 3035.5805 3063.3661 3085.4512 3104.9798 3109.9666 3493.1989 3514.6245 3567.5225
redmass: 5.4458 7.5672 13.9454 6.3486 5.1226 6.9048 8.8562 7.6687 3.3200 5.2196 7.2978 6.2451 5.6113 1.2151 5.4017 5.4547 5.7741 3.2877 10.6984 2.1539 3.0380 9.1764 2.4012 2.9894 4.6981 7.3364 5.5912 6.6405 2.9257 4.6072 5.7521 5.3747 7.4385 5.6884 2.4054 3.6446 4.5597 3.1245 3.1734 2.4975 5.3987 2.1982 2.9590 2.3144 3.7971 1.8109 2.3957 2.9862 3.7929 5.4575 1.3424 1.2760 1.3133 4.4991 1.2781 1.2954 1.4327 1.9968 1.3538 1.5931 1.7140 1.2599 1.4390 6.8996 1.6370 1.5217 1.4576 4.3265 1.0932 1.0778 5.5970 11.1070 6.5526 1.0582 1.0864 1.1011 1.0643 1.0973 1.0896 1.0905 1.0992 1.0676 1.0771 1.0664
irintensity: 5.8723 3.6576 4.7964 4.1663 14.8941 2.8414 10.8167 6.4639 2.7669 1.4508 9.3331 3.7842 12.4953 144.0158 28.3869 4.1811 23.6109 150.7493 4.1507 130.0444 9.9355 7.7652 48.1758 14.6615 44.1282 38.3917 5.8685 12.7893 9.8250 7.7008 3.6425 3.3345 8.0752 7.1242 121.9308 26.1831 7.2088 6.2681 26.4841 58.1121 62.0806 16.3400 103.0724 24.0565 31.0782 88.9704 9.7276 5.1291 44.8026 60.9961 38.2755 2.9037 32.3000 221.8881 14.8212 7.2269 106.1727 111.3080 36.2939 72.6045 118.0686 4.0965 15.6307 125.5258 1.1282 3.5142 4.8279 100.5149 13.1147 6.7716 22.3394 315.5344 746.2682 39.0288 33.6191 80.1935 13.5220 134.5940 5.5596 7.1934 12.8227 119.1712 71.6043 10.2340
temp: 298.150 k
press: 1.00000 atm
elementType: 8 8 8 8 8 8 8 7 7 7 6 6 6 6 6 6 6 6 6 1 1 1 1 1 1 1 1 1 1 1
symmnumber: 1
zpe: 565873.2 jmol-1
zpe.correction: 0.215530 hartree
zpe.thermalcorrener: 0.232795 hartree
zpe.thermalcorrenthalpy: 0.233739 hartree
zpe.thermalcorrgfe: 0.170117 hartree
zpe.sumelectzpe: -1038.854339 hartree
zpe.sumelectthermal: -1038.837074 hartree
zpe.sumelectthermalent: -1038.836130 hartree
zpe.sumelectthermalfe: -1038.899751 hartree
dipole: 6.2123 3.1241 3.6124
dipole: 7.8360
quadrupole: -128.1375 -120.2618 -107.4921
quadrupole: -2.3397 13.3851 -3.8488
quadrupole: -9.5070 -1.6313 11.1383 -2.3397 13.3851 -3.8488
hfenergy: -1039.0698686 hartree
pointgroup: C01 [X(C9H11N3O7)]
dipole: 2.2322357 -1.4199019 -1.5828089 debye
polarizability: 194.5945824|-19.2988755|165.0780092|0.1083092|7.463633|83.223692 unknown
InChI: InChI=1S/C9H11N3O7/c13-3-6-5(14)1-7(19-6)11-2-4(12(17)18)8(15)10-9(11)16/h2,5-7,10,13-14H,1,3H2
charge 0 multiplicity 1
30 atoms
O  2.064294 0.101245 1.133411
O  4.651242 -0.806591 -0.125842
O  1.477678 2.771056 0.384871
O  -0.207165 -3.154612 -0.210773
O  -3.994394 -0.42737 -0.547821
O  -1.440835 2.938332 0.058674
O  -3.568246 2.219679 0.46525
N  0.031864 -0.871539 0.286213
N  -2.08373 -1.74065 -0.303863
N  -2.328564 1.991851 0.234241
C  3.452626 -0.269935 -0.777321
C  1.528878 -1.082352 0.51404
C  2.2854 -1.295938 -0.829453
C  2.918562 0.837587 0.149082
C  2.130708 1.926009 -0.609228
C  -0.529391 0.368339 0.41862
C  -0.73007 -2.016759 -0.087471
C  -1.865102 0.609653 0.146513
C  -2.77814 -0.479301 -0.248962
H  3.695893 0.113834 -1.789983
H  1.618219 -1.931833 1.208156
H  1.620968 -1.088034 -1.686385
H  2.639706 -2.33416 -0.923064
H  3.722717 1.288612 0.749453
H  1.395331 1.469145 -1.308316
H  2.851612 2.51606 -1.213106
H  4.994868 -1.577614 -0.644009
H  0.14429 1.16357 0.771484
H  -2.664136 -2.543615 -0.571309
H  0.624817 3.15093 0.040797
