program: Gaussian 09
title: 000145678
version: EM64L-G09RevD.01
frameworkgroup: C1[X(C8H11NO)]
method: RPBEPBE
basis: SDD
operation: Freq
keyword: #p
keyword: freq=noraman
keyword: PBEPBE/SDD
title: #p freq=noraman PBEPBE/SDD
converged: YES YES NO NO
title: Mulliken charges:
elementType: O N C C C C C C C C H H H H H H H H H H H
charge: -0.418794 -0.369266 0.154435 0.357745 0.250385 -0.457850 -0.863677 -0.389871 -0.840362 -0.207279 0.227395 0.225501 0.245516 0.255591 0.255116 0.228566 0.231671 0.228407 0.221006 0.299602 0.366165
chargesum: 0.00000
title: Mulliken charges with hydrogens summed into heavy atoms:
elementType: O N C C C C C C C C
charge: -0.052629 -0.069664 0.154435 0.357745 0.250385 -0.230454 -0.137069 -0.134755 -0.151719 0.013727
polarizability: 1.27774390e+02 1.21851903e+00 1.11533896e+02 2.82236428e+00 -3.23247899e-01 5.27127180e+01
1716.lowfreq: -17.8515 -8.0804 -0.0002 0.0003 0.0007 4.1517 81.3695 120.8917 163.8454
frequency: 81.3485 120.8492 163.8390 177.2957 208.5321 222.2322 270.7611 320.0946 332.3436 353.3115 457.2168 498.9443 519.8714 529.7458 560.1629 638.6931 715.6334 737.1720 782.5603 807.9756 884.5537 892.7660 963.5003 970.4195 990.6469 1025.9651 1048.4944 1068.9713 1094.9122 1176.3470 1189.4800 1259.0782 1271.5544 1305.6691 1365.9061 1392.1132 1399.8315 1421.1750 1443.6301 1461.8793 1466.5268 1484.9012 1488.1891 1495.7707 1600.1772 1610.7126 2947.0636 2971.4753 3019.9370 3046.6778 3082.7496 3105.8350 3123.1223 3146.1061 3179.7624 3432.7422 3526.5846
redmass: 3.6209 1.5490 1.6112 1.0923 4.6369 2.6737 2.3884 2.7974 2.5979 1.4992 4.3924 3.1353 4.3882 3.4247 3.8022 2.8406 2.6143 3.1263 1.4491 4.2200 1.4093 1.9373 2.2763 1.5246 1.4494 1.4330 1.6037 2.0593 1.7860 1.1914 3.2378 1.6410 2.0268 1.6587 3.1597 1.2632 1.2313 1.7173 2.0399 1.4610 1.0514 1.4361 1.0647 1.2446 6.4509 6.1330 1.0454 1.0378 1.0918 1.0975 1.0978 1.0935 1.0865 1.0948 1.0948 1.0764 1.0684
irintensity: 0.1448 1.0828 0.0734 2.8100 2.4321 1.5088 22.3753 2.1518 35.2735 43.9773 2.5898 0.1733 2.8361 46.2326 4.7058 143.6449 9.6613 64.9569 64.3953 9.7505 5.1261 19.9140 26.1173 10.9523 10.6345 8.9837 1.8775 1.7986 15.0764 1.4874 0.9135 1.0900 16.2779 86.0086 4.9228 7.5557 11.8830 3.3788 27.5005 3.0163 25.7204 23.9710 8.7601 19.0722 41.5054 8.5656 40.8229 35.8352 22.0229 23.1868 23.6271 14.4242 8.5261 27.9010 8.7963 1.3585 25.2284
temp: 298.150 k
press: 1.00000 atm
elementType: 8 7 6 6 6 6 6 6 6 6 1 1 1 1 1 1 1 1 1 1 1
symmnumber: 1
zpe: 453706.5 jmol-1
zpe.correction: 0.172808 hartree
zpe.thermalcorrener: 0.183068 hartree
zpe.thermalcorrenthalpy: 0.184012 hartree
zpe.thermalcorrgfe: 0.137822 hartree
zpe.sumelectzpe: -440.623021 hartree
zpe.sumelectthermal: -440.612761 hartree
zpe.sumelectthermalent: -440.611816 hartree
zpe.sumelectthermalfe: -440.658007 hartree
dipole: -0.0721 -1.4643 -0.5948
dipole: 1.5821
quadrupole: -52.6828 -54.0716 -63.5915
quadrupole: 0.3735 4.3017 -1.7577
quadrupole: 4.0992 2.7103 -6.8095 0.3735 4.3017 -1.7577
hfenergy: -440.7958287 hartree
pointgroup: C01 [X(C8H11N1O1)]
dipole: 0.0380542 -0.5749108 0.2355226 debye
dipolederiv: -0.7519896 0.0925843 0.0452266 -0.0869457 -0.3441942 -0.0845458 0.2979614 -0.0938382 -0.0109387 -0.2811058 0.3147858 -0.0787247 0.6659399 -0.2669809 0.1897486 -0.5632932 0.3379236 -0.2570694 -0.3802209 0.1044558 -0.024003 -0.0544813 0.2105803 -0.0132914 0.0090429 0.0090417 -0.1070819 0.312715 0.0454609 0.0201875 0.1018301 0.1462647 0.0034678 0.0003972 -0.0063922 -0.0183809 0.7837231 -0.3972082 0.0869597 -0.5720964 0.1644778 -0.050171 0.1055986 -0.0405674 0.0369317 -0.1486066 -0.0895707 -0.0035978 -0.1323348 -0.1986355 -0.0050061 0.0067863 -0.0005682 -0.2237762 0.0123629 0.023513 -0.0128554 0.0271311 -0.1074371 0.0187739 -0.0388232 0.0118973 0.0982322 -0.1549178 -0.0062317 -0.0064282 0.2854842 -0.1560499 0.0218743 -0.0123003 -0.0212509 -0.2088466 -0.0631802 -0.0772411 -0.0029946 -0.1197202 0.0117005 -0.0047778 0.0050884 -0.0025077 0.0749309 0.1751066 0.054047 0.0182684 -0.0334869 0.1280712 -0.0075025 0.0213548 -0.0054348 -0.1355539 -0.0988839 0.1048081 -0.0096133 0.0759157 0.0313466 0.0030305 -0.0131016 0.0036957 0.1621888 0.0421675 0.0850074 0.1099066 0.0219726 -0.0210151 -0.0474655 0.0941571 -0.1097779 -0.0698989 0.0518129 0.0838769 -0.10282 0.0295088 0.0140826 0.0299682 -0.0772888 0.0842652 -0.0273641 -0.075947 -0.1468138 0.0183988 -0.0554495 0.0558686 0.000827 0.0164774 0.0074971 0.0996408 -0.0134406 -0.0858916 -0.0099554 -0.0669501 0.0524383 0.0001923 -0.0075443 0.006258 0.1696021 0.0302641 -0.0381814 -0.0033631 -0.0775488 -0.0015763 0.1115258 0.0540991 0.1217359 -0.0524738 -0.055064 0.0654052 -0.0106193 0.1814152 -0.0191364 0.0122484 -0.0125921 0.0063941 0.1046744 0.0362696 -0.0243069 0.0142827 -0.0655222 -0.0103322 -0.1208747 -0.0444886 -0.1261823 -0.0463748 0.0794049 -0.0032241 -0.0022365 -0.0005093 -0.1470952 0.0008519 -0.0049448 0.0014781 0.1538555 0.1333986 -0.0556026 -0.0013828 -0.073502 0.157473 -0.0883867 0.1831892 -0.2018747 0.1851305 0.3661315 -0.0496722 -0.0446363 -0.0506506 0.3001493 0.0295128 -0.0197756 0.0182077 0.0725723 unknown
polarizability: 127.702585|-0.8292228|111.4858372|4.1216275|0.2921302|52.8325815 unknown
InChI: InChI=1S/C8H11NO/c1-6-4-3-5-8(9-10)7(6)2/h3-5,9-10H,1-2H3
charge 0 multiplicity 1
21 atoms
O  3.290154 -0.055944 -0.116194
N  2.074342 -0.824003 0.216137
C  -0.366752 -0.799138 0.042868
C  -1.590758 -0.074499 -0.006775
C  0.862885 -0.069665 0.087045
C  -1.565809 1.345123 -0.005146
C  -0.318582 -2.318582 0.063289
C  0.879773 1.345203 0.085816
C  -2.931655 -0.793244 -0.057743
C  -0.341785 2.046001 0.0408
H  -2.511819 1.897308 -0.042703
H  0.146477 -2.730654 -0.857836
H  0.277996 -2.685831 0.92113
H  -1.322855 -2.762059 0.138122
H  1.838036 1.870068 0.09187
H  -3.10169 -1.414831 0.842305
H  -3.75885 -0.065975 -0.118807
H  -3.00994 -1.462488 -0.935457
H  -0.33684 3.141905 0.034159
H  2.10853 -1.676319 -0.361207
H  3.762341 0.003623 0.756125
