program: Gaussian 09
title: 000145677
version: EM64L-G09RevD.01
frameworkgroup: C1[X(C8H16N2O2)]
method: RPBEPBE
basis: SDD
operation: Freq
keyword: #p
keyword: freq=noraman
keyword: PBEPBE/SDD
title: #p freq=noraman PBEPBE/SDD
converged: NO YES NO NO
title: Mulliken charges:
elementType: O O N N C C C C C C C C H H H H H H H H H H H H H H H H
charge: -0.248455 -0.240943 -0.167296 -0.571455 -0.362152 -0.390376 -0.335714 -0.400809 0.253116 0.221865 -0.732932 -0.785916 0.187225 0.238227 0.265265 0.221201 0.176012 0.227700 0.215837 0.179606 0.258989 0.277058 0.258597 0.239980 0.256583 0.244239 0.269172 0.245378
chargesum: 0.00000
title: Mulliken charges with hydrogens summed into heavy atoms:
elementType: O O N N C C C C C C C C
charge: -0.248455 -0.240943 -0.167296 -0.035408 0.063300 0.096090 0.067997 -0.005365 0.253116 0.221865 0.022227 -0.027127
polarizability: 1.29653959e+02 -3.06263849e+00 1.12248542e+02 8.66415608e+00 3.60897083e-01 8.03189339e+01
1716.lowfreq: -8.2177 -6.9422 -0.0008 -0.0007 -0.0004 11.4946 34.2998 47.7828 59.2617
frequency: 34.1847 47.5265 59.2413 65.5597 99.5331 109.5070 150.3839 168.2495 202.4041 215.2630 224.1877 251.0802 313.4948 366.2089 373.1513 402.4163 419.8288 473.7735 548.0685 555.8751 581.0814 601.1083 628.4954 705.4898 746.8429 786.2043 880.1310 927.1974 959.4390 976.4856 1008.7238 1028.1928 1035.7231 1039.1639 1059.9350 1093.6169 1113.8428 1119.5532 1155.5281 1216.6827 1237.5887 1252.2189 1280.9159 1286.8087 1293.4704 1334.2422 1345.3781 1375.1127 1381.4215 1389.3416 1391.1130 1426.7572 1443.4852 1445.9943 1466.8108 1468.8574 1477.8128 1483.2779 1493.9741 1604.9791 1613.2744 1639.1223 2856.9317 2956.8981 2976.6169 2993.9926 3010.0974 3016.0978 3032.1116 3042.3443 3054.2922 3084.0465 3100.9966 3102.1729 3129.0523 3130.5345 3462.2058 3590.1668
redmass: 4.7143 3.7918 3.9637 1.7872 4.0962 2.9064 1.9994 3.5261 1.0501 1.0417 1.1783 4.7663 4.4387 3.2575 3.2078 4.4999 2.6617 3.3323 3.8425 2.8121 1.3193 3.6290 3.4609 4.1176 1.0889 1.1993 1.7821 1.8978 2.1696 1.9446 1.7800 2.3158 1.7777 1.7724 2.5817 2.6983 2.6539 3.5205 1.7278 1.5132 2.3301 2.1703 1.4639 1.0854 1.2136 1.4519 1.4936 1.3924 1.2209 1.2389 1.4285 1.1014 1.0727 1.0482 1.0686 1.0808 1.0632 1.0918 1.0919 6.3395 9.1656 1.0951 1.0720 1.0653 1.0636 1.0382 1.0356 1.0849 1.0937 1.0603 1.1011 1.0973 1.0960 1.1041 1.1031 1.0992 1.0449 1.0978
irintensity: 0.5416 9.6004 0.5210 2.6541 2.9131 1.4821 1.0901 0.9522 1.7688 0.4059 57.0329 6.3298 4.1993 5.3121 0.8827 0.6641 2.3020 31.2353 20.4898 0.7638 209.2044 17.4371 11.3607 5.1880 16.5245 3.4939 6.3282 2.1484 9.2261 40.1465 23.4781 2.8074 4.0293 13.5970 5.0818 3.6048 10.1794 37.5955 77.5552 38.4082 189.9989 39.7882 51.9337 6.5955 33.2805 61.4818 75.5942 27.7993 49.7867 62.2177 6.8584 37.4883 43.2854 17.1845 3.4293 4.9168 5.0272 12.8705 12.1510 64.8075 312.4330 39.8554 115.7077 29.7992 28.0518 4.6598 4.0854 24.3965 8.1766 30.7362 55.2843 10.9791 4.7222 17.7407 16.5786 9.9722 0.9915 0.3669
temp: 298.150 k
press: 1.00000 atm
elementType: 8 8 7 7 6 6 6 6 6 6 6 6 1 1 1 1 1 1 1 1 1 1 1 1 1 1 1 1
symmnumber: 1
zpe: 624533.7 jmol-1
zpe.correction: 0.237872 hartree
zpe.thermalcorrener: 0.252536 hartree
zpe.thermalcorrenthalpy: 0.253480 hartree
zpe.thermalcorrgfe: 0.195144 hartree
zpe.sumelectzpe: -573.438243 hartree
zpe.sumelectthermal: -573.423580 hartree
zpe.sumelectthermalent: -573.422635 hartree
zpe.sumelectthermalfe: -573.480971 hartree
dipole: 2.5121 3.1355 -0.2092
dipole: 4.0232
quadrupole: -74.6968 -77.5473 -73.0622
quadrupole: 7.7900 -7.4339 5.6240
quadrupole: 0.4053 -2.4452 2.0399 7.7900 -7.4339 5.6240
hfenergy: -573.6761156 hartree
pointgroup: C01 [X(C8H16N2O2)]
dipole: -1.0003741 1.2266198 -0.0041782 debye
polarizability: 129.5929442|3.8354709|112.112158|8.4160451|-2.5241135|80.5163325 unknown
InChI: InChI=1S/C8H16N2O2/c1-7(11)10(8(2)12)6-4-3-5-9/h3-6,9H2,1-2H3
charge 0 multiplicity 1
28 atoms
O  1.045396 -2.252924 -0.222853
O  2.997083 1.368187 0.520464
N  1.193639 0.066795 -0.26963
N  -5.144096 -0.045308 0.098365
C  -1.283427 -0.017692 0.25922
C  -0.192682 0.042731 -0.831966
C  -2.702219 0.011207 -0.349989
C  -3.808289 -0.104836 0.71961
C  1.751748 -1.233641 0.015154
C  1.846655 1.302243 0.003526
C  3.153961 -1.355961 0.57419
C  1.099862 2.580814 -0.377439
H  -1.16199 0.82921 0.965619
H  -1.144981 -0.947563 0.841933
H  -0.269097 -0.857312 -1.464588
H  -0.333944 0.925636 -1.475735
H  -2.844919 0.955238 -0.919515
H  -2.830862 -0.817657 -1.072175
H  -3.710334 -1.083496 1.227169
H  -3.633325 0.678084 1.500657
H  -5.346471 0.839322 -0.377488
H  -5.91471 -0.341282 0.703752
H  3.240849 -0.864891 1.557895
H  3.375058 -2.430888 0.664428
H  3.898057 -0.861442 -0.071544
H  1.02149 2.688463 -1.475099
H  1.684582 3.426302 0.013572
H  0.080465 2.619862 0.043369
