program: Gaussian 09
title: 000145673
version: EM64L-G09RevD.01
frameworkgroup: C1[X(C6H12NO2)]
method: RPBEPBE
basis: SDD
operation: Freq
keyword: #p
keyword: freq=noraman
keyword: PBEPBE/SDD
title: #p freq=noraman PBEPBE/SDD
converged: YES YES NO NO
title: Mulliken charges:
elementType: O O N C C C C C C H H H H H H H H H H H H
charge: -0.174088 -0.138482 -0.109567 -0.355349 -0.454766 -0.561558 -0.540171 -0.332854 0.233556 0.292358 0.289362 0.310568 0.312848 0.291360 0.278451 0.276204 0.278747 0.273912 0.274930 0.263024 0.291517
chargesum: 1.00000
title: Mulliken charges with hydrogens summed into heavy atoms:
elementType: O O N C C C C C C
charge: -0.174088 -0.138482 -0.109567 0.226371 0.168650 0.284457 0.287417 0.221687 0.233556
polarizability: 7.93194148e+01 5.08050026e+00 7.75175073e+01 -1.09761590e+00 -1.75846110e-01 5.91449068e+01
1716.lowfreq: -26.6676 0.0007 0.0009 0.0010 3.1091 13.9204 82.0223 101.8753 193.4022
frequency: 81.9720 101.8636 193.3249 245.1208 276.6683 289.6177 323.1077 353.8482 413.9641 439.0083 472.3601 491.0419 532.2635 619.3621 715.6300 745.6037 860.5553 881.3985 898.3805 944.1950 973.3192 994.4810 1056.3619 1065.2771 1097.0145 1131.1575 1140.0222 1185.2228 1203.3092 1227.5287 1272.7187 1301.2971 1334.1777 1369.8646 1376.9290 1424.9995 1433.8684 1444.8710 1456.0316 1462.6076 1474.6145 1478.5174 1481.3285 1495.5722 1686.4921 3023.4836 3028.0943 3033.3052 3036.9950 3042.6654 3107.9161 3116.3034 3118.6289 3142.8775 3144.7857 3146.8364 3151.2049
redmass: 3.5573 4.8743 1.1415 1.1542 2.3226 1.6148 2.9077 3.7140 2.1926 3.3581 3.5856 3.8125 3.6295 3.7528 2.6607 4.5447 2.8801 2.5864 3.3995 3.0299 1.8493 2.0850 2.9773 1.5594 1.4330 2.1972 2.0720 1.4885 1.6328 1.2648 1.3641 1.4077 1.3362 1.2829 1.3193 1.1478 1.0784 1.1121 1.0926 1.0481 1.0761 1.0648 1.0505 1.0644 12.0419 1.0322 1.0338 1.0610 1.0605 1.0632 1.1046 1.1048 1.1067 1.1058 1.1059 1.1055 1.1062
irintensity: 4.6559 6.2355 0.6769 0.6932 1.1689 1.2985 1.4010 2.1368 0.1337 0.0778 1.4905 3.3043 2.1260 2.0731 2.1933 23.5382 18.0327 8.2501 54.2514 23.2237 0.3958 12.5952 20.4918 15.8598 26.8711 75.7425 60.7916 38.3006 5.0852 20.4535 8.9494 7.2369 1.6645 0.6434 4.0354 15.1369 9.1525 6.4264 9.3025 5.6223 59.7673 49.5741 40.2179 19.9848 256.4688 1.1306 0.2772 0.7127 1.5238 13.7664 0.6370 1.8816 1.2663 0.7131 1.1972 1.5655 2.0321
temp: 298.150 k
press: 1.00000 atm
elementType: 8 8 7 6 6 6 6 6 6 1 1 1 1 1 1 1 1 1 1 1 1
symmnumber: 1
zpe: 475754.6 jmol-1
zpe.correction: 0.181205 hartree
zpe.thermalcorrener: 0.190414 hartree
zpe.thermalcorrenthalpy: 0.191358 hartree
zpe.thermalcorrgfe: 0.147538 hartree
zpe.sumelectzpe: -440.026263 hartree
zpe.sumelectthermal: -440.017055 hartree
zpe.sumelectthermalent: -440.016111 hartree
zpe.sumelectthermalfe: -440.059930 hartree
dipole: 8.8575 1.2319 -0.2585
dipole: 8.9465
quadrupole: -51.4634 -42.4844 -44.2433
quadrupole: -4.5383 0.5091 0.1482
quadrupole: -5.3997 3.5793 1.8204 -4.5383 0.5091 0.1482
hfenergy: -440.2074686 hartree
pointgroup: C01 [X(C6H12N1O2)]
dipole: -3.5046758 -0.3227641 -0.0474347 debye
dipolederiv: -0.410555 -0.0427812 -0.0442214 -0.4107694 -1.2428156 0.1029936 -0.0446159 0.0547313 -0.2960057 -0.7859144 -0.3251429 -0.0075688 -0.2115196 -0.7148209 0.0260363 -0.0354494 0.0119501 -0.2854875 -0.4809063 0.0536978 -0.0260192 0.0552926 -0.3481963 0.0235241 -0.0044099 -0.0115836 -0.3241456 0.0251574 -0.0960551 -0.045362 -0.1087989 0.312332 0.1077225 -0.0568285 0.1342626 0.1127068 0.1931407 0.1993688 -0.1032665 0.2698343 0.0203391 -0.0042919 -0.1567648 0.0106556 0.1240255 0.0632224 0.0177906 -0.051787 0.0002055 0.0552772 -0.0036893 -0.0693947 0.008996 0.3132855 0.2436573 -0.0893221 0.1031768 -0.0953429 0.1184964 -0.0497429 0.1357774 -0.0532331 0.1263981 0.4180208 0.3119708 -0.038081 0.2061222 0.3485506 -0.0743782 0.0016399 -0.0400698 0.3115094 1.1102144 0.153132 0.0933207 0.4014289 1.6873867 -0.0942159 0.1154235 -0.0721841 0.2554381 0.1117014 0.0195305 0.0139493 0.0405948 0.047198 0.0691819 0.0032401 0.0224738 -0.0244307 -0.0279877 -0.0715449 0.0279908 0.0068906 0.0895854 -0.0024868 0.051429 0.0098026 0.1096861 0.0591325 0.0308396 0.0252116 0.0022389 0.0727873 -0.0362581 0.0416179 -0.0661691 0.0967701 0.0468709 0.0014069 -0.0315205 -0.0319081 0.1255611 -0.0262627 -0.013648 0.0073291 0.0197497 -0.0147748 0.0341194 -0.0441334 0.0358152 0.1110002 0.0320233 -0.0130046 0.0107192 0.0849318 0.1190612 0.0273311 0.0185842 0.0466894 -0.0164133 -0.0262657 -0.0054704 0.0347138 0.1000808 0.0517747 -0.0750813 0.0183875 -0.0911428 0.0506924 0.015232 -0.0201135 -0.0287089 0.083928 0.0975299 -0.0384848 -0.036088 0.018947 -0.0035359 -0.0356633 -0.0214045 -0.0695183 0.0956913 0.0819212 0.0266831 0.0708833 0.0204824 0.1167494 -0.039095 0.0172426 -0.0118693 -0.0178351 0.0278038 -0.0202004 0.0079534 -0.0757833 0.0535166 0.0559462 0.0369945 0.0617586 0.0892397 0.0040047 -0.1077767 0.0303649 -0.0542185 0.0905729 -0.0108876 0.0359198 0.0547268 -0.0660989 0.066925 -0.0094811 0.0182256 -0.0250583 0.0257366 -0.0294225 0.0018193 -0.0687831 0.0905628 unknown
polarizability: 79.8155355|5.0220893|76.9738207|0.5811732|-1.0936054|59.1924728 unknown
InChI: InChI=1S/C6H12NO2/c1-7(2)3-4-9-6(8)5-7/h3-5H2,1-2H3
charge 1 multiplicity 1
21 atoms
O  1.543905 -0.963106 0.010707
O  2.466077 1.132423 -0.046391
N  -1.150741 0.233577 0.00059
C  -0.901896 -1.1950 -0.522758
C  0.081675 1.07822 -0.371661
C  -1.353433 0.250858 1.518941
C  -2.393314 0.817127 -0.676592
C  0.331149 -1.816007 0.129985
C  1.452399 0.426997 -0.089334
H  -0.773667 -1.10786 -1.615459
H  -1.799496 -1.800528 -0.312503
H  0.035501 2.032256 0.177019
H  0.028949 1.296842 -1.453256
H  -0.412296 -0.00194 2.0282
H  -1.665154 1.263512 1.816679
H  -2.136898 -0.474493 1.786126
H  -2.484091 1.879753 -0.403406
H  -2.290755 0.719522 -1.768254
H  -3.282217 0.266252 -0.33262
H  0.186722 -2.040834 1.200654
H  0.586878 -2.754371 -0.386266
