program: Gaussian 09
title: 000145668
version: EM64L-G09RevD.01
frameworkgroup: C1[X(C4H6Cl3NO)]
method: RPBEPBE
basis: SDD
operation: Freq
keyword: #p
keyword: freq=noraman
keyword: PBEPBE/SDD
title: #p freq=noraman PBEPBE/SDD
converged: YES YES NO NO
title: Mulliken charges:
elementType: Cl Cl Cl O N C C C C H H H H H H
charge: 0.056353 0.153583 0.106198 -0.386485 -0.089750 -0.379060 -0.419585 0.032921 -0.620934 0.249899 0.237320 0.224995 0.253863 0.228592 0.352090
chargesum: 0.00000
title: Mulliken charges with hydrogens summed into heavy atoms:
elementType: Cl Cl Cl O N C C C C
charge: 0.056353 0.153583 0.106198 -0.034395 -0.089750 0.108159 0.059273 0.261514 -0.620934
polarizability: 9.01807184e+01 -6.32075514e+00 8.40881773e+01 -5.36547832e+00 -1.35775252e+00 7.38169462e+01
1716.lowfreq: -7.0188 0.0014 0.0020 0.0024 7.4305 8.9471 51.9949 66.1016 126.8073
frequency: 51.7841 66.0693 126.8047 168.7592 204.9797 242.5700 252.9030 267.1606 306.9442 338.5736 347.6372 367.3248 515.1385 607.9921 661.7453 744.6970 761.9602 821.7333 826.3047 969.1635 973.2110 1009.1253 1046.3152 1071.4397 1088.0032 1119.9473 1145.3429 1212.0280 1277.3798 1302.0993 1355.2996 1461.0774 1477.6102 2851.3733 3070.6899 3088.2657 3185.1036 3202.9016 3529.3672
redmass: 3.0485 6.4806 5.9143 14.7263 7.7481 12.3444 6.0955 6.2331 5.2343 2.1263 1.6848 14.0861 5.6200 6.1188 8.2147 4.0757 1.9357 3.1585 3.7576 2.2983 1.4024 4.0375 3.0906 1.2743 1.3079 1.6029 1.4759 1.3672 2.1330 1.1735 1.6235 1.0804 1.1724 1.0806 1.0543 1.0590 1.1153 1.1162 1.0654
irintensity: 3.8714 1.0233 0.8281 0.2828 0.4002 1.1031 3.0621 2.8068 8.4632 68.2720 96.2811 8.6821 5.8059 76.7171 133.3115 85.1162 76.8770 15.2665 15.9687 28.9061 40.5763 67.1893 24.5234 8.5122 14.8081 10.4907 0.4051 74.2859 37.7986 16.7230 97.7983 5.9954 5.0098 55.5181 19.0966 21.8412 2.2626 23.8012 15.3368
temp: 298.150 k
press: 1.00000 atm
elementType: 17 17 17 8 7 6 6 6 6 1 1 1 1 1 1
symmnumber: 1
zpe: 257895.9 jmol-1
zpe.correction: 0.098227 hartree
zpe.thermalcorrener: 0.108609 hartree
zpe.thermalcorrenthalpy: 0.109554 hartree
zpe.thermalcorrgfe: 0.061182 hartree
zpe.sumelectzpe: -1665.382077 hartree
zpe.sumelectthermal: -1665.371695 hartree
zpe.sumelectthermalent: -1665.370751 hartree
zpe.sumelectthermalfe: -1665.419122 hartree
dipole: -1.7391 -0.0305 -2.4763
dipole: 3.0262
quadrupole: -69.8182 -73.1130 -73.2311
quadrupole: -3.8610 2.1271 2.2019
quadrupole: 2.2359 -1.0589 -1.1770 -3.8610 2.1271 2.2019
hfenergy: -1665.4803043 hartree
pointgroup: C01 [X(C4H6Cl3N1O1)]
dipole: -0.7021311 0.0536778 0.9600119 debye
dipolederiv: -0.5981192 -0.1886045 -0.2577754 -0.199744 -0.347875 -0.1903888 -0.2924319 -0.183344 -0.4109153 -0.1614247 -0.0230974 0.1626505 -0.013422 -0.1133184 0.0911368 0.1823447 0.076246 -0.7191329 -0.1589139 -0.0056171 0.0141273 -0.0179816 -0.783514 0.1469768 0.0296314 0.1651186 -0.1843493 -0.4444731 0.0673905 0.1693411 -0.0392927 -0.8789185 -0.0132908 0.1646397 -0.0104872 -0.3368116 -1.1135534 -0.2447134 0.0145438 -0.1652798 -0.1987052 -0.0314616 -0.1425541 -0.0550909 -0.2907985 0.2558774 0.0015368 0.0448633 0.04111 0.0438557 -0.0065449 0.0309258 -0.0106922 0.2088595 0.1966289 0.112245 -0.0081578 0.0823111 0.0785159 0.0756041 0.0010527 0.0745869 0.185492 0.9832311 0.0447733 -0.0040275 0.1223607 0.6259441 0.0175455 0.1517094 0.0622256 0.2406616 0.7294782 0.3389208 0.1363646 0.285321 1.1493805 -0.0520682 0.1607302 -0.0774063 1.3573962 -0.0195906 0.0458697 -0.0715463 0.0737877 0.0713274 0.0105837 -0.1032233 0.025132 0.0019487 0.0363363 0.0304015 -0.0286735 0.050036 0.0233443 -0.0861971 0.045163 -0.109143 -0.0325203 0.0744748 -0.0196491 -0.0807768 -0.0290792 0.0401342 0.0171206 -0.0016518 0.070103 -0.1083928 0.0992663 -0.0393569 -0.0244361 -0.0993397 -0.057441 -0.0374179 -0.0277389 -0.0578357 0.0386381 -0.0739683 -0.0062385 0.064075 -0.0061519 -0.0403264 0.0250756 -0.0546915 0.0324672 -0.2117074 0.1947502 -0.1138608 -0.1305721 -0.0846356 0.3875965 0.0333261 -0.1439053 -0.0018803 0.2616321 unknown
polarizability: 89.8464328|6.6842999|84.0727017|5.3426274|-1.694765|74.1667073 unknown
InChI: InChI=1S/C4H6Cl3NO/c5-4(6,7)3(9)8-1-2-8/h3,9H,1-2H2
charge 0 multiplicity 1
15 atoms
Cl 2.527325 0.607705 1.06478
Cl 1.586263 0.049034 -1.76421
Cl 1.141707 -2.013655 0.411932
O  -0.176913 1.886995 0.140175
N  -1.26835 -0.106066 -0.389327
C  -2.655518 0.364017 -0.021274
C  -2.217049 -1.052422 0.310652
C  -0.186495 0.46551 0.414414
C  1.171873 -0.198897 0.002346
H  -3.30653 0.556881 -0.877792
H  -2.749049 1.079007 0.804953
H  -2.02663 -1.291482 1.365367
H  -2.547244 -1.895356 -0.30192
H  -0.28337 0.278437 1.516521
H  0.616881 2.297093 0.574583
