program: Gaussian 09
title: 000145666
version: EM64L-G09RevD.01
frameworkgroup: C1[X(C7H8N2O2)]
method: RPBEPBE
basis: SDD
operation: Freq
keyword: #pfreq=noraman
keyword: PBEPBE/SDD
title: #p freq=noraman PBEPBE/SDD
converged: NO YES NO NO
title: Mulliken charges:
elementType: O O N N C C C C C C C H H H H H H H H
charge: -0.426687 -0.276248 -0.155104 0.048385 0.415305 -0.308232 -0.324798 -0.384245 -0.329045 0.286774 -0.678936 0.243750 0.284805 0.222724 0.256876 0.244440 0.279941 0.244425 0.355868
chargesum: 0.00000
title: Mulliken charges with hydrogens summed into heavy atoms:
elementType: O O N N C C C C C C C
charge: -0.070819 -0.276248 -0.155104 0.048385 0.415305 -0.064482 -0.039992 -0.161521 -0.072169 0.286774 0.089870
polarizability: 1.73967490e+02 9.86415801e+00 1.00986012e+02 8.25613894e-02 -2.40500242e-01 4.33458876e+01
1716.lowfreq: -8.9187 0.0006 0.0009 0.0010 4.8292 7.4594 25.0446 89.2089 174.0875
frequency: 24.7409 89.2010 174.0858 182.6075 211.0601 317.8043 334.8230 355.7138 362.2642 392.6198 406.2715 410.9545 457.0107 520.0005 601.5246 634.2763 713.7533 776.0748 792.5041 810.6306 841.7308 863.2640 913.6859 978.8025 995.2708 1047.7935 1103.8086 1105.7787 1143.8790 1167.3161 1184.5578 1250.8643 1300.6143 1315.2005 1356.8013 1397.9246 1410.7751 1441.5810 1471.1090 1487.2789 1504.8411 1592.8824 1628.1574 2986.8663 3080.2467 3099.0733 3122.6550 3166.8649 3169.0004 3197.4938 3581.6179
redmass: 3.6527 5.6894 6.3534 1.2468 3.6912 4.8947 5.2634 1.1574 4.7250 5.1663 5.2754 3.1725 4.1454 2.4230 6.7387 7.0396 3.8384 5.0593 1.3546 6.8827 1.5131 3.6809 1.3583 1.3331 2.9546 4.9324 1.3202 1.4517 1.4137 1.5818 1.1756 2.3580 2.8014 1.7484 4.7485 6.5269 1.2788 3.2267 1.0909 1.0480 2.7759 6.9484 6.4298 1.0321 1.1025 1.0994 1.0899 1.0912 1.0928 1.0955 1.0661
irintensity: 1.8614 0.1118 2.5937 0.0517 0.0368 2.7440 2.5886 147.7203 20.1631 3.4437 2.4274 0.0873 2.8583 31.2777 13.3485 6.1805 0.0264 0.6104 34.4420 80.4093 57.2242 114.8283 0.5004 0.6500 6.8301 83.0752 0.0655 67.5482 255.3535 7.1356 30.4965 11.3662 116.6969 12.3949 90.5142 73.3756 45.3194 18.4895 18.2875 22.3063 154.2567 13.2839 31.8391 23.3672 19.7306 3.0144 18.9078 9.8762 2.5054 0.8165 55.4067
temp: 298.150 k
press: 1.00000 atm
elementType: 8 8 7 7 6 6 6 6 6 6 6 1 1 1 1 1 1 1 1
symmnumber: 1
zpe: 373687.4 jmol-1
zpe.correction: 0.142330 hartree
zpe.thermalcorrener: 0.152540 hartree
zpe.thermalcorrenthalpy: 0.153484 hartree
zpe.thermalcorrgfe: 0.106023 hartree
zpe.sumelectzpe: -530.615527 hartree
zpe.sumelectthermal: -530.605317 hartree
zpe.sumelectthermalent: -530.604372 hartree
zpe.sumelectthermalfe: -530.651833 hartree
dipole: 3.0641 4.4940 0.0421
dipole: 5.4394
quadrupole: -70.4620 -57.4852 -66.6112
quadrupole: -1.4698 -0.3050 -0.1660
quadrupole: -5.6092 7.3676 -1.7584 -1.4698 -0.3050 -0.1660
hfenergy: -530.7578566 hartree
pointgroup: C01 [X(C7H8N2O2)]
dipole: 1.2275745 1.7465541 -0.1494075 debye
dipolederiv: -1.711951 0.0869554 0.0887405 0.1280736 -0.0617376 -0.0301987 0.0860247 -0.0273498 -0.4274111 -1.7108725 -0.5941519 0.1225373 0.1878112 -0.2232069 -0.0136045 0.1052567 0.0430126 -0.2200289 -0.6631919 -0.079113 0.044085 -0.8253309 -0.4822418 0.072689 0.0560685 0.0150866 -0.0919964 1.546618 0.8270794 -0.1362648 0.7139608 0.4138857 -0.0631105 -0.1406388 -0.0742884 -0.0596513 0.7249695 -0.0598104 -0.0474836 0.0427935 -0.1783382 0.0030059 -0.0418017 0.013576 0.0439665 0.08486 0.1443348 -0.0262805 -0.1006373 0.0650134 -0.0049139 -0.0129145 -0.0243599 -0.162039 0.0411504 -0.0598664 -0.0086647 0.0632028 0.0563514 -0.0164306 -0.0149334 -0.0052771 -0.1324413 -0.3372004 -0.0620181 0.0131748 0.4348626 0.0211119 -0.0440638 -0.0162413 -0.0080132 -0.2000968 -0.3183552 0.0519775 0.0076776 -0.317799 0.0961667 0.0076835 0.0298058 -0.0182741 -0.1607994 1.5695484 -0.0613174 -0.1052517 -0.1161457 0.0100869 0.012692 -0.1027368 0.0084655 0.0810191 -0.0428601 -0.1459847 0.0241243 -0.0609327 0.123428 0.004443 0.0299407 0.0137314 0.2251593 0.0698842 0.0807105 0.0018715 0.0854535 -0.0431246 0.0055184 0.0015201 0.0063241 0.1615878 0.0902935 -0.0687219 0.0103568 -0.0421478 0.0440238 0.0108147 0.0094053 0.0120309 0.16548 -0.0371491 -0.1003829 0.0212049 -0.1010602 -0.0243053 0.0186907 0.0210525 0.0182847 0.1714189 0.0538383 0.0641833 0.0047726 0.0680694 -0.0158294 0.0056451 0.0048512 0.0059807 0.1682855 0.1052086 -0.0548099 -0.0996442 -0.0057194 -0.0176413 -0.054856 -0.0656071 -0.0748162 -0.0255036 -0.0215854 0.0738146 0.0141404 -0.1250954 0.1690826 0.0116738 0.017272 -0.0059273 0.1373353 0.1274122 -0.0326426 0.073197 0.0086988 -0.010625 0.0523949 0.0338859 0.0820658 -0.0618161 0.4293827 -0.0102362 -0.0022931 -0.0380576 0.0578998 0.021927 -0.0002098 0.0197476 0.3875317 unknown
polarizability: 173.5666573|8.4035436|100.5394469|-9.6301423|-3.4008048|44.1932857 unknown
InChI: InChI=1S/C7H8N2O2/c1-9(8-11)6-2-4-7(10)5-3-6/h2-5,10H,1H3
charge 0 multiplicity 1
19 atoms
O  3.895282 -0.310949 -0.168228
O  -3.735748 -0.77597 0.38305
N  -1.731514 0.270634 0.213425
N  -2.465739 -0.929221 0.296874
C  -0.309415 0.138463 0.115757
C  0.504322 1.292106 -0.009855
C  0.306946 -1.14682 0.14302
C  1.907648 1.171945 -0.106192
C  1.701254 -1.263829 0.04632
C  2.508604 -0.106435 -0.078491
C  -2.403748 1.579831 0.226801
H  0.06048 2.291072 -0.035214
H  -0.314212 -2.038983 0.239776
H  2.52148 2.07654 -0.202664
H  2.184754 -2.244755 0.066851
H  -2.052985 2.190251 1.077272
H  -3.482755 1.380091 0.335936
H  -2.225343 2.123789 -0.717619
H  4.37779 0.548539 -0.253318
