program: Gaussian 09
title: 000145662
version: EM64L-G09RevD.01
frameworkgroup: C1[X(C9H10N2O4)]
method: RPBEPBE
basis: SDD
operation: Freq
keyword: #p
keyword: freq=noraman
keyword: PBEPBE/SDD
title: #p freq=noraman PBEPBE/SDD
converged: NO YES NO NO
title: Mulliken charges:
elementType: O O O O N N C C C C C C C C C H H H H H H H H H H
charge: -0.431369 -0.225448 -0.199357 -0.198974 -0.681314 0.027869 -0.142871 0.098119 0.292828 -0.352107 -0.340437 -0.337560 0.383163 -0.384320 -0.362594 0.240768 0.218368 0.233638 0.291351 0.291168 0.295023 0.338855 0.293507 0.292299 0.359394
chargesum: 0.00000
title: Mulliken charges with hydrogens summed into heavy atoms:
elementType: O O O O N N C C C C C C C C C
charge: -0.071976 -0.225448 -0.199357 -0.198974 -0.047436 0.027869 0.097897 0.098119 0.292828 0.099900 -0.049086 -0.046392 0.383163 -0.090813 -0.070295
polarizability: 2.52344841e+02 -2.32075683e+00 1.27350121e+02 -9.31992917e+00 -1.67433348e+01 7.15848503e+01
1716.lowfreq: -123.5463 -5.7506 0.0008 0.0009 0.0010 2.8939 12.7596 36.4844 49.1846
frequency: -123.5452 36.1485 49.1720 72.4505 77.0245 117.2376 139.2470 175.7800 230.8204 247.4621 263.0410 318.8739 338.2520 349.3886 370.7581 404.1862 413.0052 466.9093 478.4694 497.4420 518.4481 622.9842 656.0909 671.1223 687.6966 732.1165 760.5452 791.3519 850.6434 881.0047 900.2254 951.7625 967.7005 985.3985 990.5346 1006.1911 1014.0142 1089.3246 1091.4085 1114.9490 1126.4128 1171.9476 1185.9595 1216.5520 1229.4250 1265.7084 1302.4524 1311.7053 1340.0609 1366.0774 1386.6655 1400.9189 1411.7981 1447.7788 1476.3645 1537.2829 1584.9622 1598.3128 1608.6456 2963.3804 2997.4742 3099.2170 3162.5780 3172.7098 3186.1168 3190.3209 3552.3702 3574.3832 3716.2927
redmass: 1.3280 6.6399 6.5420 5.0236 5.8389 6.6248 3.1164 3.6485 6.7797 6.9583 6.4430 4.2067 2.8270 1.3449 1.6594 2.6554 2.6914 3.4734 4.6980 5.7716 6.0476 7.0587 5.4541 5.6801 3.5928 3.8531 4.0399 7.8808 1.3086 1.5279 2.1288 6.2603 2.5211 2.2575 2.2858 2.7498 1.3792 1.8139 1.7914 1.3075 1.1282 2.9147 1.6755 4.5557 2.8114 1.3216 1.3044 1.2203 1.2661 5.6540 1.6502 10.4524 3.5330 1.0885 2.3002 3.3643 2.4641 3.1822 3.5914 1.0818 1.0645 1.1029 1.0898 1.0888 1.0956 1.0968 1.0453 1.0666 1.1031
irintensity: 239.5899 0.0809 0.3219 0.9256 9.9720 9.2069 20.5963 2.1722 2.6591 6.0290 3.9677 28.4102 18.5379 188.3185 123.7847 21.6532 13.5849 1.3408 5.0741 2.3655 1.5860 0.1827 5.4983 3.0105 25.7602 7.6757 4.5773 29.0925 4.2540 59.0080 12.6993 99.8546 9.2105 55.0213 42.8587 1.7860 0.7035 12.1813 7.8152 19.4154 23.4171 39.4067 131.9051 340.9533 18.8362 23.3736 2.0656 3.5045 19.1742 75.1850 11.3278 4.9853 71.0620 3.5424 1.2888 161.8143 28.3654 43.0800 7.8094 16.1410 65.0470 21.1151 1.8019 0.8070 0.4587 1.1705 56.6644 7.3566 38.6357
temp: 298.150 k
press: 1.00000 atm
elementType: 8 8 8 8 7 7 6 6 6 6 6 6 6 6 6 1 1 1 1 1 1 1 1 1 1
symmnumber: 1
zpe: 483967.5 jmol-1
zpe.correction: 0.184334 hartree
zpe.thermalcorrener: 0.198344 hartree
zpe.thermalcorrenthalpy: 0.199288 hartree
zpe.thermalcorrgfe: 0.142466 hartree
zpe.sumelectzpe: -758.142683 hartree
zpe.sumelectthermal: -758.128673 hartree
zpe.sumelectthermalent: -758.127729 hartree
zpe.sumelectthermalfe: -758.184550 hartree
dipole: 4.2904 0.1233 -0.4860
dipole: 4.3196
quadrupole: -103.7520 -94.3357 -83.7117
quadrupole: 5.5155 -4.9326 -2.4198
quadrupole: -9.8189 -0.4026 10.2214 5.5155 -4.9326 -2.4198
hfenergy: -758.3270165 hartree
pointgroup: C01 [X(C9H10N2O4)]
dipole: -1.6481883 -0.0275797 0.4133539 debye
dipolederiv: -0.4416872 -0.2270373 0.0293755 0.0023618 -0.5016263 0.3312653 -0.2575235 0.363975 -0.6255099 -0.4843238 -0.1697424 0.0522279 -0.0534499 -0.8870536 0.0945938 0.0035111 -0.0469509 -0.2783002 -0.7199092 -0.2003961 0.0548461 -0.3940701 -0.7057802 -0.0461519 0.0271792 -0.0752864 -0.2472617 -0.8940542 0.1390342 0.180516 0.2525685 -0.553087 -0.1389559 0.2400508 -0.1194748 -0.3031324 -1.023415 -0.1489662 -0.0537676 -0.2554889 -0.3065731 0.2031717 -0.0044405 0.1630632 -0.8853045 2.0450196 0.1694355 -0.3599677 0.2956419 1.0611931 0.1654418 -0.4020342 0.1873576 0.3196238 0.0212183 0.392026 -0.0997305 0.8133464 -0.1857928 -0.0931862 -0.5051674 0.0877638 0.366079 0.9446857 0.0777233 -0.0952985 -0.251905 0.9679018 -0.0385483 -0.1224701 0.110499 0.0495924 -0.0982786 -0.1692409 0.0223643 -0.0184865 -0.0023266 0.0268834 0.1115661 0.0281387 -0.0328673 0.4724037 0.193769 -0.1414231 -0.148462 0.4911712 -0.1834589 0.3915329 -0.3601723 0.4347074 -0.1211721 -0.2148319 -0.0252125 -0.1448585 -0.047754 0.0165682 0.0083671 0.0256676 -0.0831877 -0.2818812 0.1925054 0.0780716 0.0383339 0.0541993 0.0293076 0.0092999 -0.0137841 -0.0977478 -0.8296361 -0.1265259 0.1551809 -0.2046033 0.1077202 0.0374408 0.1483491 0.0411851 0.048121 0.1468495 0.2030995 -0.021904 -0.0724813 -0.0338625 0.0440586 -0.0695644 -0.0426071 -0.0954978 0.1598881 -0.173139 -0.0997126 0.1861186 -0.0864491 -0.0230182 -0.0318732 0.0463304 -0.0883845 0.0482066 -0.0946177 -0.0688621 -0.0902454 -0.0317528 -0.0707775 -0.0552928 -0.0754204 -0.0098243 -0.0083995 -0.0268113 -0.0306481 -0.1174164 -0.0494902 -0.0864531 -0.0736565 -0.0281949 -0.0649217 -0.1075063 0.0757381 0.0486046 0.0902133 0.0000801 0.0003176 0.0441511 0.0178388 0.043261 0.059494 0.0525451 0.0524486 0.0439005 0.0608391 -0.0281112 0.0389169 -0.0151675 0.1185025 0.1147294 -0.0552737 -0.0021224 -0.0164343 0.0359325 -0.028172 0.0021161 -0.0130617 0.1441905 0.319996 0.0066616 0.0989413 -0.0445082 0.1489539 -0.0286579 0.1298834 -0.0443314 0.3290138 0.3033247 0.0565008 0.0619449 0.0578173 0.1691618 -0.0094365 0.0850568 -0.0189631 0.3128343 0.1087214 -0.0412641 0.0009024 -0.0192184 0.0601698 -0.0246124 0.0260256 -0.0187279 0.1604725 0.0840681 0.0520407 0.0336307 0.0105027 0.0933471 -0.0230238 0.0380747 -0.0326744 0.1544418 0.1816583 0.0367673 0.1295942 0.0408235 0.1408784 -0.1264851 0.2179419 -0.1670023 0.3310997 unknown
polarizability: 245.5160748|9.2405528|131.671716|-34.8119602|5.73599|74.0920212 unknown
InChI: InChI=1S/C9H10N2O4/c10-8(5-12)9(13)6-1-3-7(4-2-6)11(14)15/h1-4,8,12H,5,10H2
charge 0 multiplicity 1
25 atoms
O  -2.422054 1.907073 -0.919718
O  -2.232953 -2.119745 0.5208
O  4.021939 1.683136 -0.231957
O  4.405256 -0.473471 -0.871041
N  -4.146105 -0.519725 1.428356
N  3.63509 0.470814 -0.446273
C  -2.979599 0.151559 0.90601
C  -1.905941 -0.894142 0.578579
C  -0.487358 -0.481185 0.300434
C  -3.397914 0.941683 -0.410152
C  -0.005931 0.841299 0.516459
C  0.413348 -1.48452 -0.159185
C  2.207593 0.140045 -0.188937
C  1.345302 1.156924 0.272338
C  1.761626 -1.18314 -0.410076
H  -2.567563 0.903228 1.611645
H  -3.709529 0.203036 -1.175266
H  -4.27318 1.549982 -0.132573
H  -0.677714 1.625499 0.873252
H  0.023956 -2.496708 -0.305886
H  -4.831414 -0.014371 1.978135
H  -4.160329 -1.537219 1.400618
H  1.738002 2.164341 0.431757
H  2.467925 -1.937373 -0.766196
H  -1.736953 1.451278 -1.469421
