program: Gaussian 09
title: 000145729
version: EM64L-G09RevD.01
frameworkgroup: C1[X(C9H14N2O11P2)]
method: RPBEPBE
basis: SDD
operation: Freq
keyword: #p
keyword: freq=noraman
keyword: PBEPBE/SDD
title: #p freq=noraman PBEPBE/SDD
converged: YES YES NO NO
title: Mulliken charges:
elementType: P P O O O O O O O O O O O N N C C C C C C C C C H H H H H H H H H H H H H H
charge: 1.440794 1.444425 -0.266053 -0.425402 -0.506771 -0.240794 -0.766643 -0.693432 -0.545831 -0.357864 -0.768115 -0.688143 -0.608037 -0.196706 -0.369675 -0.147638 -0.060338 -0.547387 0.008569 -0.327680 0.223473 -0.046896 -0.326749 0.213822 0.231345 0.298992 0.262934 0.284460 0.287628 0.275124 0.255113 0.344451 0.330646 0.369678 0.303508 0.455129 0.431820 0.428242
chargesum: 0.00000
title: Mulliken charges with hydrogens summed into heavy atoms:
elementType: P P O O O O O O O O O O O N N C C C C C C C C C
charge: 1.440794 1.444425 -0.266053 -0.080951 -0.506771 -0.240794 -0.766643 -0.238303 -0.545831 -0.357864 -0.336295 -0.259901 -0.608037 -0.196706 0.000003 0.083707 0.238654 0.000008 0.296198 0.202557 0.223473 0.283750 -0.023242 0.213822
polarizability: 2.24201614e+02 1.24860338e+01 1.99318767e+02 1.63255533e+01 -1.19622637e+01 1.44200838e+02
1716.lowfreq: -11.3834 -8.4831 -0.0008 -0.0007 0.0009 6.4363 38.4949 44.4536 50.5938
frequency: 38.3669 44.4155 50.5329 62.3860 84.0299 88.7616 99.2854 112.0501 122.1558 143.7263 160.7994 164.9315 174.7460 193.6913 196.4905 209.9574 222.5433 225.7736 236.5384 257.9869 289.0919 295.9595 301.3188 320.9437 326.8284 334.7535 341.1386 354.0165 377.9647 394.2336 411.8663 421.4049 429.5667 450.9335 522.8574 524.1896 533.8031 540.2309 597.8193 649.7384 666.3459 673.1731 687.0459 691.6213 701.9070 728.4125 745.7676 749.0501 756.7582 775.8027 786.7267 798.3377 814.1067 843.8544 869.6139 921.1191 940.4737 947.5210 965.1849 978.1249 982.7861 1006.7583 1012.6099 1034.0192 1042.0964 1050.3384 1055.1370 1070.8281 1086.6781 1097.1934 1148.2737 1170.7035 1186.4820 1200.3035 1202.9553 1230.3443 1234.8149 1257.3480 1270.0430 1286.3169 1312.4162 1315.4393 1326.4282 1332.4927 1359.4973 1379.2443 1384.2922 1399.3535 1449.1339 1453.7729 1472.1104 1552.6812 1619.0929 1653.5248 2215.1932 2978.1134 2990.3072 3039.6146 3057.3150 3066.0834 3102.0977 3116.0809 3193.8843 3214.8480 3225.2213 3518.7204 3567.1518 3629.9615
redmass: 8.7800 8.7783 9.2126 11.1774 5.1007 6.9696 6.9840 4.1883 6.0837 3.7942 6.6978 4.1456 3.9684 6.0264 5.4682 7.0340 4.3746 5.6275 8.7069 5.2685 4.2648 1.4377 3.9426 6.5713 6.4316 7.1296 7.6107 5.5220 8.1117 8.9209 5.7345 4.7425 5.8341 2.9050 4.5604 7.0889 6.5898 5.1434 5.7919 2.0652 2.9522 4.2783 4.9190 5.4549 2.0828 4.7450 6.3082 8.4897 6.8307 2.3284 3.8710 3.7417 1.6486 10.1547 3.1880 3.0889 2.6047 5.8900 2.9760 1.3647 2.0874 1.4300 1.1046 3.9163 3.7956 4.2531 2.1179 2.6739 2.7388 7.6105 2.2278 1.5126 1.3152 1.7272 1.8191 1.2210 1.2321 1.2708 1.4782 1.3642 1.4962 1.7446 1.3107 1.3135 1.9628 1.4251 1.2437 1.3584 3.9462 1.0874 1.0772 3.7390 5.6412 6.7604 1.1253 1.0615 1.0840 1.0654 1.1044 1.0882 1.0888 1.1016 1.0920 1.0679 1.0976 1.0773 1.0664 1.0666
irintensity: 1.7347 0.0608 1.9704 1.5160 11.1736 0.0268 11.8986 19.0499 5.3773 23.8735 9.4077 12.4895 24.5284 4.9217 28.2603 18.5546 23.4443 13.5941 5.0414 34.8995 10.1571 66.7706 103.4813 5.9569 40.4132 8.4509 27.0623 32.8741 44.1037 58.1438 33.1487 23.3036 26.5415 7.5449 14.7932 27.4042 7.9780 30.3117 7.7561 50.3654 59.2553 7.7418 74.7648 45.0959 21.7220 37.9023 324.8368 235.9595 10.5857 92.9681 6.9830 14.7516 128.5429 142.7322 15.0035 41.1470 60.0372 108.3323 12.3184 5.6896 5.9412 202.9162 159.5240 88.3789 10.2644 55.4496 27.0175 55.2630 44.2762 156.7922 12.9120 20.4975 28.4252 91.8797 140.4595 5.2032 7.2863 50.7140 224.1654 20.9571 207.6198 238.9463 1.0566 16.6403 20.6437 10.3414 327.4223 1.9026 75.1125 14.2741 13.9708 93.8698 234.7873 623.3183 1768.7916 22.2739 34.5163 6.3746 9.0117 12.2740 6.4221 9.7112 10.5912 300.3070 4.7294 80.2844 10.4040 123.2869
temp: 298.150 k
press: 1.00000 atm
elementType: 15 15 8 8 8 8 8 8 8 8 8 8 8 7 7 6 6 6 6 6 6 6 6 6 1 1 1 1 1 1 1 1 1 1 1 1 1 1
symmnumber: 1
zpe: 681266.6 jmol-1
zpe.correction: 0.259481 hartree
zpe.thermalcorrener: 0.283810 hartree
zpe.thermalcorrenthalpy: 0.284754 hartree
zpe.thermalcorrgfe: 0.206557 hartree
zpe.sumelectzpe: -1968.947191 hartree
zpe.sumelectthermal: -1968.922862 hartree
zpe.sumelectthermalent: -1968.921918 hartree
zpe.sumelectthermalfe: -1969.000115 hartree
dipole: -3.0786 1.8115 -4.5241
dipole: 5.7642
quadrupole: -148.5384 -171.9202 -154.8814
quadrupole: 9.7856 -7.9079 13.7596
quadrupole: 9.9083 -13.4735 3.5652 9.7856 -7.9079 13.7596
hfenergy: -1969.2066717 hartree
pointgroup: C01 [X(C9H14N2O11P2)]
dipole: 0.9671982 0.1367229 -2.0466593 debye
polarizability: 197.6267299|21.5876067|213.1965102|-29.8072017|6.4891097|156.8979794 unknown
InChI: InChI=1S/C9H14N2O11P2/c12-5-3-8(11-2-1-7(13)10-9(11)14)21-6(5)4-20-24(18,19)22-23(15,16)17/h1-2,5-6,8,10,12,15-16,18H,3-4H2
charge 0 multiplicity 1
38 atoms
P  -2.866162 0.771336 1.330129
P  -2.088229 -1.593225 -0.628089
O  1.394916 1.989395 1.022077
O  2.060282 4.323218 -0.727694
O  -1.544763 1.860129 1.233543
O  3.517728 -0.640103 -1.550089
O  -2.145873 -0.786018 0.895793
O  -3.777217 1.134121 -0.071737
O  -3.543404 0.749775 2.747159
O  0.41893 -3.90225 -0.333418
O  -3.755474 -1.359235 -1.05621
O  -2.019927 -3.228439 -0.319434
O  -1.045828 -0.942025 -1.637452
N  1.997661 -0.183095 0.191244
N  2.08624 -2.337266 -0.788462
C  1.21829 3.166384 -1.048995
C  0.442008 2.833391 0.240617
C  2.039377 1.878441 -1.309645
C  2.298691 1.307566 0.111729
C  -0.880978 2.12152 -0.070057
C  2.613785 -1.028663 -0.765205
C  1.12918 -0.671881 1.149175
C  0.675634 -1.973915 1.121545
C  1.034744 -2.815646 0.006948
H  0.545445 3.393816 -1.900647
H  0.270277 3.728827 0.857272
H  1.448246 1.166113 -1.910723
H  2.98106 2.06896 -1.845617
H  3.331353 1.461417 0.464286
H  -0.727258 1.176064 -0.626737
H  -1.532328 2.789466 -0.663287
H  2.650141 4.524378 -1.497486
H  0.782594 0.062999 1.878519
H  2.402733 -2.928527 -1.564775
H  -0.043861 -2.327973 1.858406
H  -4.144125 0.31945 -0.54797
H  -4.223969 -2.128753 -1.46278
H  -1.039718 -3.669151 -0.277732
