program: Gaussian 09
title: 000145698
version: EM64L-G09RevD.01
frameworkgroup: C1[X(C16H11Cl5O2)]
method: RPBEPBE
basis: SDD
operation: Freq
keyword: #p
keyword: freq=noraman
keyword: PBEPBE/SDD
title: #p freq=noraman PBEPBE/SDD
converged: YES YES NO NO
title: Mulliken charges:
elementType: Cl Cl Cl Cl Cl O O C C C C C C C C C C C C C C C C H H H H H H H H H H H
charge: 0.130804 0.117669 0.137728 -0.047068 -0.045989 -0.292017 -0.187969 0.228630 0.441166 0.361648 -0.767817 -0.318001 -0.338092 -0.389791 -0.342102 -0.227505 -0.216242 -0.222549 -0.205661 0.302080 -0.121832 -0.119747 -0.752099 0.262453 0.271206 0.268621 0.284303 0.257699 0.259835 0.256636 0.257811 0.250861 0.256672 0.248657
chargesum: 0.00000
title: Mulliken charges with hydrogens summed into heavy atoms:
elementType: Cl Cl Cl Cl Cl O O C C C C C C C C C C C C C C C C
charge: 0.130804 0.117669 0.137728 -0.047068 -0.045989 -0.292017 -0.187969 0.228630 0.441166 0.361648 -0.767817 -0.055549 -0.066886 -0.121169 -0.057799 0.030195 0.043593 0.034088 0.052150 0.302080 -0.121832 -0.119747 0.004092
polarizability: 2.84995956e+02 1.21778062e+00 2.19022018e+02 2.05348003e+01 -1.56155450e+01 1.80108639e+02
1716.lowfreq: -7.6191 -0.0015 0.0013 0.0016 4.0724 4.4714 30.6911 31.4537 38.3343
frequency: 30.6644 31.4389 38.2328 47.2942 58.5319 71.6688 82.5900 88.2674 99.4663 109.8100 144.4329 147.9070 180.4483 182.3071 196.2996 202.8577 230.5582 240.0279 258.3798 274.6108 286.6450 311.4156 322.3473 346.2417 353.9198 369.2263 406.8224 412.7918 423.7737 444.7543 485.9283 518.1569 530.8472 548.1094 616.4642 624.4553 634.3225 660.9568 672.7904 710.4149 715.1050 723.6907 728.3050 751.4258 803.3607 824.2013 832.4530 837.9003 850.3064 916.9277 932.2751 955.3384 959.7695 967.5492 976.4718 982.3513 992.9032 1001.9203 1004.1691 1038.5254 1076.1950 1080.5287 1114.7170 1125.4104 1149.0169 1169.9152 1190.0346 1201.1262 1204.0197 1295.3355 1307.6281 1365.7837 1371.8774 1379.6856 1391.2825 1399.8722 1451.6042 1452.3682 1472.7103 1480.0790 1582.9275 1586.2686 1595.1829 1600.9290 1687.0096 3008.2374 3098.0923 3140.1071 3143.6622 3156.1976 3165.5743 3165.8788 3172.9915 3176.8125 3193.3633 3194.8492
redmass: 10.8178 7.5863 2.2968 7.0867 6.4736 1.6274 3.2304 5.7347 12.7833 10.3929 9.1754 8.5878 20.4629 15.5598 17.2184 11.8690 11.1191 6.7878 13.7560 26.5005 12.9191 5.8709 4.8720 5.7553 5.2265 16.7608 2.8933 2.9539 9.2603 6.9526 3.9307 3.5600 3.7230 3.1194 7.4162 6.9868 8.1185 6.5988 6.6074 6.8659 8.5653 4.4417 6.0710 5.0423 2.0618 1.2760 1.3360 1.5121 2.9663 9.0041 3.8376 1.5292 1.5144 1.3767 1.4396 2.2709 4.7175 4.0607 3.9827 1.6557 2.7819 2.7090 1.3615 1.4051 2.8049 3.7346 1.1422 2.5486 1.4278 1.2509 1.2808 6.3237 5.6047 1.2296 3.7869 3.2333 1.0482 1.0542 2.3008 2.2677 7.7099 7.5287 6.2933 6.0942 10.5112 1.0364 1.0975 1.0893 1.1012 1.0887 1.0905 1.0904 1.0958 1.0968 1.0951 1.0949
irintensity: 0.0878 0.5798 2.2085 0.7444 0.4041 0.4551 0.1894 0.4577 0.2569 1.2544 0.5985 0.5822 0.5777 1.1285 0.4445 0.9922 1.0329 2.0741 1.2051 0.2574 1.3005 1.0418 2.8662 5.0566 2.9698 0.9442 0.1099 0.5303 25.2055 17.7484 13.4140 14.3013 49.6277 2.4067 2.3453 3.4063 0.8324 32.7861 15.5871 97.8596 68.3353 6.0111 51.4960 83.2423 20.4392 2.0778 6.8220 21.7776 135.0445 109.3960 100.6374 25.0560 13.6224 0.6467 3.6550 39.0892 14.6163 29.8515 44.8363 7.6672 43.4764 50.0165 10.3559 10.0291 258.1256 67.3370 4.3559 7.9251 8.8038 0.9390 0.3414 1.3703 1.4704 53.1581 10.9813 9.1756 20.7596 21.9223 80.9726 67.2079 2.3771 12.4845 39.3622 17.5034 190.3306 1.5001 4.9301 4.1762 8.6704 2.3292 1.8443 1.4941 2.2457 1.7742 0.6471 0.9227
temp: 298.150 k
press: 1.00000 atm
elementType: 17 17 17 17 17 8 8 6 6 6 6 6 6 6 6 6 6 6 6 6 6 6 6 1 1 1 1 1 1 1 1 1 1 1
symmnumber: 1
zpe: 589390.5 jmol-1
zpe.correction: 0.224487 hartree
zpe.thermalcorrener: 0.247495 hartree
zpe.thermalcorrenthalpy: 0.248439 hartree
zpe.thermalcorrgfe: 0.169804 hartree
zpe.sumelectzpe: -3065.384462 hartree
zpe.sumelectthermal: -3065.361454 hartree
zpe.sumelectthermalent: -3065.360510 hartree
zpe.sumelectthermalfe: -3065.439145 hartree
dipole: 1.1275 -0.6804 1.8544
dipole: 2.2744
quadrupole: -185.2021 -169.7299 -153.7431
quadrupole: -1.8472 7.2125 -7.1269
quadrupole: -15.6437 -0.1715 15.8152 -1.8472 7.2125 -7.1269
hfenergy: -3065.6089493 hartree
pointgroup: C01 [X(C16H11Cl5O2)]
dipole: 0.3890273 -0.428521 0.6824516 debye
polarizability: 282.72443|-6.7174935|224.053944|23.655405|-9.2573451|177.3482393 unknown
InChI: InChI=1S/C16H11Cl5O2/c1-10(22)23-15(16(19,20)21,11-2-6-13(17)7-3-11)12-4-8-14(18)9-5-12/h2-9H,1H3
charge 0 multiplicity 1
34 atoms
Cl 1.584695 -2.896598 -1.315143
Cl 0.499988 -0.728197 -3.089195
Cl -1.356669 -2.74423 -1.815559
Cl -4.470638 3.464801 0.05486
Cl 5.371509 2.242044 0.646924
O  -0.068276 -1.700403 0.901449
O  -2.428347 -1.879506 1.072328
C  0.034676 -0.755277 -0.262912
C  -1.130321 0.258166 -0.276644
C  1.375524 -0.013427 -0.027431
C  0.16464 -1.704562 -1.527876
C  -1.236311 1.082838 0.875628
C  1.621991 1.224043 -0.673688
C  -2.05537 0.442551 -1.328778
C  2.36709 -0.550003 0.829756
C  -2.249036 2.05236 0.991165
C  2.836988 1.913238 -0.478732
C  -3.071769 1.419666 -1.233479
C  3.583551 0.133385 1.043178
C  -1.290188 -2.18961 1.452405
C  -3.158272 2.207839 -0.073646
C  3.802682 1.355161 0.380232
C  -0.933109 -3.141467 2.574075
H  -0.519956 0.964526 1.695823
H  0.863745 1.664205 -1.327316
H  -2.016831 -0.168034 -2.23203
H  2.184085 -1.49828 1.337837
H  -2.328256 2.674716 1.886758
H  3.023285 2.866395 -0.981062
H  -3.786132 1.554621 -2.050431
H  4.345429 -0.280716 1.709451
H  -1.853385 -3.485798 3.067349
H  -0.383211 -4.008171 2.167485
H  -0.275202 -2.646179 3.30832
