program: Gaussian 09
title: 000145660
version: EM64L-G09RevD.01
frameworkgroup: C1[X(C18H20N2O)]
method: RPBEPBE
basis: SDD
operation: Freq
keyword: #p
keyword: freq=noraman
keyword: PBEPBE/SDD
title: #p freq=noraman PBEPBE/SDD
converged: YES YES NO NO
title: Mulliken charges:
elementType: O N N C C C C C C C C C C C C C C C C C C H H H H H H H H H H H H H H H H H H H H
charge: -0.263471 -0.219067 -0.076472 -0.488232 -0.396111 0.236406 0.236667 -0.340580 0.155586 0.154738 0.051155 -0.332507 -0.338960 -0.355945 -0.355473 -0.250146 -0.248673 -0.262495 -0.263501 -0.627778 -0.615189 0.241544 0.236690 0.241162 0.240496 0.173007 0.211497 0.239962 0.239177 0.281583 0.281853 0.228350 0.227475 0.234780 0.234831 0.185740 0.223605 0.239142 0.188278 0.225355 0.225521
chargesum: 0.00000
title: Mulliken charges with hydrogens summed into heavy atoms:
elementType: O N N C C C C C C C C C C C C C C C C C C
charge: -0.263471 -0.219067 -0.076472 -0.009998 0.085547 0.236406 0.236667 0.043924 0.155586 0.154738 0.051155 -0.092545 -0.099783 -0.074363 -0.073621 -0.021796 -0.021197 -0.027716 -0.028669 0.020709 0.023965
polarizability: 2.53944623e+02 1.57673490e+00 2.90033438e+02 -2.32391136e+01 -7.15694342e-01 1.16437246e+02
1716.lowfreq: -9.6064 -6.9074 -4.5401 -0.0003 0.0007 0.0008 21.8482 30.1666 34.4881
frequency: 21.5667 30.0408 34.4365 66.2651 94.0425 111.3136 132.8571 147.3994 154.5606 176.1239 232.2429 243.3511 248.7895 267.0229 290.9790 323.0572 330.1217 363.0305 381.2410 409.4222 412.6516 425.8022 432.8126 466.5589 480.5886 520.6791 528.4009 570.9423 604.8009 625.7076 637.9968 668.6032 675.5488 732.3436 761.8245 763.5863 766.0249 779.2814 803.9197 820.8297 836.8682 864.5403 870.6899 896.5229 922.2930 965.9047 967.7015 1000.0246 1002.0874 1009.6675 1033.5387 1035.7984 1039.3209 1045.5032 1059.1412 1071.9720 1093.6445 1098.6403 1104.8654 1132.9963 1142.5069 1172.5637 1176.6397 1177.7636 1186.0660 1216.2776 1237.7653 1259.1257 1267.1865 1273.2289 1288.1521 1293.1084 1298.3951 1310.5224 1355.0854 1368.7892 1380.9102 1392.8095 1398.7402 1420.5052 1441.7371 1444.5163 1459.6821 1461.8027 1463.7559 1474.8795 1477.0675 1479.7409 1481.9214 1485.3061 1489.7695 1520.7855 1540.8496 1563.5583 1590.9262 1612.7816 1627.1003 2802.0173 2844.7970 2861.0287 2992.6665 3002.4799 3020.7293 3022.2324 3033.7113 3052.9369 3077.0797 3079.8743 3090.2708 3132.0530 3133.1227 3147.9540 3148.2002 3164.2636 3164.7896 3174.2388 3175.5667
redmass: 3.1208 3.9376 4.4462 5.1778 2.9895 2.8512 3.6058 2.3650 4.3083 4.6066 1.1604 4.6468 1.2198 3.4590 3.0948 7.0206 2.4226 4.0566 5.5704 2.6291 3.5903 2.4545 6.6435 3.2297 3.0968 3.5332 5.5513 4.0393 5.5471 5.5342 5.6545 3.3748 5.4458 3.3470 1.3191 1.5059 1.2808 4.7254 2.6252 4.3791 1.8883 1.4094 1.7360 2.1045 6.5096 1.3510 1.3678 1.3272 1.3465 3.3905 1.5489 3.4655 2.4248 1.9714 3.9543 2.0990 1.3772 1.7159 1.8654 2.0581 1.5882 1.5907 1.8041 1.1515 1.1952 1.8117 1.4318 2.0704 2.6940 1.6307 1.4846 1.8808 1.2613 1.9879 1.3317 1.8794 1.3962 11.1030 10.8992 1.1442 2.5138 1.1749 2.3729 1.0609 1.0566 1.0688 3.8145 1.0643 1.5148 1.4205 1.1145 1.0901 10.1057 6.5743 7.7968 6.3287 6.8143 1.0705 1.0574 1.0571 1.0835 1.0614 1.0723 1.0603 1.0717 1.1008 1.1044 1.1012 1.1005 1.0863 1.0862 1.0896 1.0896 1.0950 1.0954 1.0979 1.0976
irintensity: 0.2163 0.3112 1.9415 2.0432 0.5009 0.6410 0.5546 0.6515 0.2635 0.0436 1.1804 0.0077 0.1038 2.9572 2.8739 11.6104 6.2958 5.6496 5.1138 0.8952 1.6053 0.3861 2.4888 0.0105 12.6857 0.1024 5.3596 5.5295 0.5389 0.7215 4.6127 27.1858 4.4364 0.0731 8.6724 98.5175 53.2194 6.2611 1.6232 19.3734 4.2392 0.6261 0.9014 0.3859 21.0209 0.2538 2.5411 0.0822 1.7222 19.8608 14.2915 12.6426 1.2910 24.6077 4.1878 23.2224 5.8261 7.5906 11.1369 8.6092 4.0983 15.7908 4.8151 2.1064 17.6659 20.2169 0.2468 18.7776 29.4729 5.7257 10.6963 35.0272 4.4262 31.4959 13.0636 46.0934 18.1653 0.5207 48.9448 2.8322 0.0924 3.6916 74.2200 13.1297 13.9150 10.0224 207.4002 26.7536 16.0415 20.6084 17.8161 14.8579 156.5566 1.6418 127.2924 154.5205 28.2994 87.7650 68.4434 206.1204 17.0787 9.1679 40.0768 48.9526 41.8362 2.0821 23.4101 39.2950 46.4325 6.0483 5.2488 6.5095 1.4626 23.5927 22.6767 31.0001 16.5400
temp: 298.150 k
press: 1.00000 atm
elementType: 8 7 7 6 6 6 6 6 6 6 6 6 6 6 6 6 6 6 6 6 6 1 1 1 1 1 1 1 1 1 1 1 1 1 1 1 1 1 1 1 1
symmnumber: 1
zpe: 890864.0 jmol-1
zpe.correction: 0.339312 hartree
zpe.thermalcorrener: 0.358088 hartree
zpe.thermalcorrenthalpy: 0.359032 hartree
zpe.thermalcorrgfe: 0.291024 hartree
zpe.sumelectzpe: -881.130438 hartree
zpe.sumelectthermal: -881.111663 hartree
zpe.sumelectthermalent: -881.110719 hartree
zpe.sumelectthermalfe: -881.178727 hartree
dipole: 6.4979 0.3903 -1.5538
dipole: 6.6925
quadrupole: -135.0703 -109.3736 -128.0615
quadrupole: 3.9810 -1.5793 1.3694
quadrupole: -10.9019 14.7949 -3.8931 3.9810 -1.5793 1.3694
hfenergy: -881.4697505 hartree
pointgroup: C01 [X(C18H20N2O1)]
dipole: -2.5605066 -0.0799904 -0.6084239 debye
polarizability: 254.1254317|1.8982126|289.8435364|23.0382207|4.094032|116.4463392 unknown
InChI: InChI=1S/C18H20N2O/c1-19(2)12-7-13-20-16-10-5-3-8-14(16)18(21)15-9-4-6-11-17(15)20/h3-6,8-11H,7,12-13H2,1-2H3
charge 0 multiplicity 1
41 atoms
O  4.132679 -0.271012 0.540432
N  0.084454 0.048875 -0.51698
N  -4.858547 0.428216 0.472196
C  -1.303223 0.163776 -1.028655
C  -2.377385 0.180953 0.083699
C  0.81943 1.219246 -0.221795
C  0.655135 -1.230368 -0.333482
C  -3.796241 0.15649 -0.52209
C  2.204238 1.132092 0.14082
C  2.036207 -1.362147 0.030308
C  2.890064 -0.174129 0.252879
C  0.21226 2.511806 -0.275811
C  -0.117475 -2.421068 -0.503082
C  2.941256 2.31674 0.407398
C  2.606501 -2.653344 0.18755
C  0.964521 3.666493 -0.006126
C  0.472128 -3.685284 -0.34059
C  2.341145 3.580795 0.332272
C  1.844279 -3.814604 0.001504
C  -4.950293 -0.602724 1.526934
C  -6.165739 0.664117 -0.176565
H  -1.373149 1.077627 -1.6431
H  -1.486652 -0.674906 -1.722769
H  -2.271756 1.088475 0.706368
H  -2.217886 -0.68845 0.74784
H  -3.956849 -0.827881 -1.043341
H  -3.86726 0.942064 -1.301423
H  -0.850012 2.625536 -0.503462
H  -1.182297 -2.372162 -0.742501
H  3.995744 2.188864 0.674031
H  3.666422 -2.690876 0.460719
H  0.471549 4.644228 -0.050751
H  -0.145264 -4.5809 -0.473986
H  2.91781 4.487627 0.539605
H  2.293403 -4.805016 0.125062
H  -5.17528 -1.624247 1.124152
H  -5.75344 -0.330014 2.233899
H  -4.00843 -0.657444 2.097956
H  -6.557492 -0.228515 -0.728715
H  -6.080746 1.499452 -0.894557
H  -6.912609 0.945917 0.586661
