program: Gaussian 09
title: 000145658
version: EM64L-G09RevD.01
frameworkgroup: C1[X(C7H16N3OP)]
method: RPBEPBE
basis: SDD
operation: Freq
keyword: #p
keyword: freq=noraman
keyword: PBEPBE/SDD
title: #p freq=noraman PBEPBE/SDD
converged: YES YES NO NO
title: Mulliken charges:
elementType: P O N N N C C C C C C C H H H H H H H H H H H H H H H H
charge: 1.212026 -0.640540 -0.399328 -0.397331 -0.735452 -0.396424 -0.387335 -0.388888 -0.393028 -0.296624 -0.330633 -0.677753 0.259743 0.247462 0.247370 0.249082 0.249345 0.247165 0.247040 0.260135 0.332844 0.202977 0.247564 0.209647 0.188059 0.207328 0.216348 0.219200
chargesum: 0.00000
title: Mulliken charges with hydrogens summed into heavy atoms:
elementType: P O N N N C C C C C C C
charge: 1.212026 -0.640540 -0.399328 -0.397331 -0.402608 0.110780 0.109117 0.107622 0.114148 0.153918 0.067072 -0.034877
polarizability: 1.42667759e+02 -5.07015511e-01 1.25622362e+02 -1.34176649e-01 -1.01803345e-01 9.46268847e+01
1716.lowfreq: -21.5611 -16.8051 -10.6198 0.0009 0.0011 0.0018 6.2079 32.6942 44.9502
frequency: -18.5148 32.4113 44.6583 56.6579 69.9135 116.1391 122.9590 137.2407 178.6194 203.5811 220.5713 249.6277 281.0057 288.6272 336.1433 384.2997 422.1702 434.8092 484.0380 551.2264 611.0028 742.4464 792.2599 793.0491 804.6978 806.4315 811.9853 877.9307 882.9375 885.6348 895.8080 988.4995 992.5307 996.8372 1044.5582 1065.8744 1074.5882 1106.3499 1109.7198 1114.1142 1114.4823 1119.7603 1120.4297 1134.2574 1148.0982 1152.3468 1233.0428 1234.6273 1239.9422 1288.0632 1303.5083 1359.0887 1387.3783 1404.9218 1443.8105 1445.7324 1458.9988 1461.9617 1464.8945 1472.9051 1477.8112 1486.2367 2964.3323 2976.0821 2978.1608 3024.4840 3049.8194 3071.1057 3072.2585 3073.4318 3076.9504 3078.6580 3079.1276 3180.4626 3181.3505 3197.4551 3198.4337 3569.2275
redmass: 3.1306 3.0609 2.5317 2.9831 2.2287 4.0474 2.5939 3.7001 3.9748 3.3307 1.1490 2.6753 3.2409 3.6939 4.2434 5.3144 4.8688 1.6476 2.9609 6.0779 8.3651 1.1697 3.2908 8.7719 6.9027 1.1382 1.1206 1.5279 2.3966 2.4938 3.3641 1.0633 4.4609 1.2027 3.1518 1.2452 1.2773 1.3282 2.1742 1.4030 1.7992 1.7848 1.3361 1.6128 1.3867 1.3846 3.2752 1.2695 3.4677 1.1863 1.2330 1.3390 1.2100 1.3113 1.0763 1.0769 1.1765 1.1466 1.0872 1.0663 1.0424 1.0731 1.0638 1.0372 1.0611 1.0961 1.1013 1.0490 1.0491 1.1006 1.0608 1.0977 1.0622 1.1173 1.1177 1.1175 1.1175 1.0760
irintensity: 0.0234 0.0287 0.7132 3.6634 0.9629 11.0927 1.5377 8.8775 14.2587 12.1548 0.6294 1.9760 2.5257 1.6284 1.0792 5.8028 11.7647 80.1841 40.9999 30.3881 157.8718 27.1380 65.4530 5.5806 12.0403 34.9008 21.1715 8.6889 60.0317 159.4396 118.0819 1.1894 62.3234 11.1692 6.1303 3.1020 10.2011 4.6553 12.8614 24.5463 26.7106 90.3665 3.6952 27.7482 0.0157 0.3287 68.5289 13.1181 24.9972 13.0457 1.2632 0.5104 5.0446 53.5628 5.2004 8.5898 2.1251 2.2898 2.5814 5.3745 12.4772 15.4268 37.2360 62.6914 30.9608 7.7283 4.6215 5.5794 24.6053 71.0721 39.4775 52.0337 15.4376 0.1177 1.7843 10.0268 21.8540 26.0513
temp: 298.150 k
press: 1.00000 atm
elementType: 15 8 7 7 7 6 6 6 6 6 6 6 1 1 1 1 1 1 1 1 1 1 1 1 1 1 1 1
symmnumber: 1
zpe: 608514.0 jmol-1
zpe.correction: 0.231771 hartree
zpe.thermalcorrener: 0.246145 hartree
zpe.thermalcorrenthalpy: 0.247089 hartree
zpe.thermalcorrgfe: 0.189241 hartree
zpe.sumelectzpe: -855.960384 hartree
zpe.sumelectthermal: -855.946009 hartree
zpe.sumelectthermalent: -855.945065 hartree
zpe.sumelectthermalfe: -856.002914 hartree
dipole: 0.0896 0.1879 -1.0641
dipole: 1.0842
quadrupole: -70.7368 -72.7794 -88.9354
quadrupole: 0.2026 3.6395 1.3615
quadrupole: 6.7471 4.7045 -11.4515 0.2026 3.6395 1.3615
hfenergy: -856.1921545 hartree
pointgroup: C01 [X(C7H16N3O1P1)]
dipole: 0.0435398 -0.066161 0.4191499 debye
polarizability: 141.6347016|4.0627795|126.63711|0.9444316|0.1226012|94.6451935 unknown
InChI: InChI=1S/C7H16N3OP/c1-2-3-8-12(11,9-4-5-9)10-6-7-10/h8H,2-7H2,1H3
charge 0 multiplicity 1
28 atoms
P  0.465324 0.268819 -0.008403
O  0.307049 0.289472 -1.613689
N  1.252351 -1.170134 0.715654
N  1.468228 1.558643 0.72786
N  -1.039259 0.38771 0.80474
C  1.053358 -2.488375 -0.007213
C  2.408522 -1.805594 -0.033553
C  2.701604 2.024705 -0.025411
C  1.465777 2.90356 0.026691
C  -2.334386 0.476976 0.108016
C  -3.223172 -0.773274 0.303249
C  -4.594007 -0.617854 -0.389988
H  0.477576 -2.478715 -0.941699
H  0.879093 -3.339149 0.657718
H  3.218135 -2.160124 0.610958
H  2.714448 -1.36012 -0.988656
H  2.93096 1.554647 -0.990331
H  3.559702 2.242542 0.617045
H  1.428015 3.759406 0.706768
H  0.885597 2.997921 -0.900168
H  -1.035016 0.344183 1.824752
H  -2.881092 1.377748 0.456379
H  -2.11869 0.619046 -0.967668
H  -2.688517 -1.656595 -0.096253
H  -3.369451 -0.953301 1.387683
H  -5.150284 0.249141 0.0142
H  -4.4735 -0.462679 -1.47848
H  -5.219765 -1.516702 -0.244501
