program: Gaussian 09
title: 000145656
version: EM64L-G09RevD.01
frameworkgroup: C1[X(C10H19N3)]
method: RPBEPBE
basis: SDD
operation: Freq
keyword: #pfreq=noraman
keyword: PBEPBE/SDD
title: #p freq=noraman PBEPBE/SDD
converged: YES YES NO NO
title: Mulliken charges:
elementType: N N N C C C C C C C C C C H H H H H H H H H H H H H H H H H H H
charge: -0.211888 -0.203604 -0.164180 -0.361113 -0.368766 -0.434155 0.329667 -0.343073 -0.040016 -0.427115 -0.476961 -0.699480 -0.696892 0.206201 0.217225 0.217718 0.206607 0.226996 0.203943 0.210320 0.210779 0.283388 0.198375 0.218658 0.218454 0.190884 0.210289 0.204329 0.237454 0.229270 0.215125 0.191561
chargesum: 0.00000
title: Mulliken charges with hydrogens summed into heavy atoms:
elementType: N N N C C C C C C C C C C
charge: -0.211888 -0.203604 -0.164180 0.062313 0.055559 -0.003216 0.329667 0.078026 0.243371 -0.010082 -0.067622 -0.047408 -0.060935
polarizability: 1.49856888e+02 3.64356474e+00 1.35218247e+02 1.59695840e+00 3.48202616e+00 9.80479401e+01
1716.lowfreq: -26.3182 -6.9247 -0.0007 -0.0006 -0.0005 7.5214 11.8957 59.9540 73.4478
frequency: -19.4659 59.8463 73.3796 117.5251 155.2529 179.4145 182.8640 211.1578 232.9099 270.3779 304.4231 311.5049 368.0022 404.4658 436.5297 449.9656 472.4098 522.1404 564.5000 613.3276 660.2263 676.2824 795.1135 863.3986 872.4673 885.3516 898.0477 900.6186 910.9585 922.6353 933.7718 959.6716 1020.5163 1041.3142 1061.8777 1094.0000 1101.3174 1108.9288 1138.9310 1158.8192 1172.5871 1176.4664 1198.9192 1205.1970 1216.9426 1235.2873 1246.3763 1281.0094 1284.4233 1306.7011 1324.4012 1335.8876 1338.0009 1346.0998 1351.0715 1364.4943 1366.6367 1382.6201 1393.7688 1438.5746 1453.7889 1456.2682 1463.2309 1466.1002 1468.8012 1477.3716 1480.5824 1485.6158 1494.0244 1512.4648 1582.1713 2901.3786 2908.5528 2914.3062 2924.5962 2960.7153 2968.3150 2971.7020 2973.0066 2996.9362 3007.6400 3023.7922 3024.7668 3052.3322 3056.7679 3059.2790 3070.5618 3071.3194 3081.9500 3086.6248
redmass: 2.6704 2.8307 2.4838 2.5068 3.7519 2.8389 2.8004 1.1410 1.1086 2.4288 1.7778 1.8692 3.0428 3.3524 3.4579 3.2615 3.6598 2.7661 2.4944 2.3994 8.0594 3.2347 2.7695 1.6871 2.5005 1.5037 1.7969 1.8042 1.2841 2.3967 1.3598 2.6651 1.9970 2.0602 2.7194 1.7502 1.9300 1.8399 2.4523 2.0771 1.6167 1.4416 1.7948 1.5356 1.5500 1.7564 2.4066 1.6274 1.3985 1.5071 1.2792 1.4122 1.3993 1.4373 1.4231 1.3981 1.2249 1.2227 1.5221 1.8402 1.1069 1.0984 1.0483 1.0738 1.1171 1.0568 1.0627 1.0824 1.0931 1.2983 5.6619 1.0713 1.0651 1.0702 1.0643 1.0952 1.0360 1.0386 1.0925 1.0656 1.0616 1.0891 1.0848 1.0890 1.0979 1.1040 1.0960 1.1041 1.1002 1.0997
irintensity: 0.0320 2.7343 0.6026 6.3237 1.4827 0.8908 3.4862 0.1423 0.2123 0.0675 9.4473 0.3342 1.2995 1.0560 6.7601 0.5748 9.8281 2.4536 1.4647 4.1016 13.0035 4.8180 0.8305 1.9264 2.6144 1.4586 4.5911 10.6095 1.4120 1.1635 0.2922 2.4694 5.0458 3.3321 37.1795 19.8090 3.9105 13.4008 20.3080 15.7097 6.0444 45.1538 62.8851 13.9722 18.2712 52.3774 38.0734 6.0142 29.8217 125.3504 48.2119 7.2043 3.3976 0.9094 45.4210 20.2880 22.5458 12.1666 5.1774 104.5233 16.6518 10.9342 2.0652 2.5325 16.0428 5.3672 12.5769 9.7032 14.4120 87.1250 378.0023 51.2697 130.8357 68.4755 126.4835 53.8664 26.7959 49.8500 28.7255 53.5147 49.4095 90.7480 8.9908 36.1967 2.3544 57.3934 88.3330 34.0668 22.3350 44.6501
temp: 298.150 k
press: 1.00000 atm
elementType: 7 7 7 6 6 6 6 6 6 6 6 6 6 1 1 1 1 1 1 1 1 1 1 1 1 1 1 1 1 1 1 1
symmnumber: 1
zpe: 743447.2 jmol-1
zpe.correction: 0.283164 hartree
zpe.thermalcorrener: 0.295738 hartree
zpe.thermalcorrenthalpy: 0.296682 hartree
zpe.thermalcorrgfe: 0.244821 hartree
zpe.sumelectzpe: -555.662325 hartree
zpe.sumelectthermal: -555.649752 hartree
zpe.sumelectthermalent: -555.648808 hartree
zpe.sumelectthermalfe: -555.700668 hartree
dipole: -0.7691 3.1198 0.6014
dipole: 3.2690
quadrupole: -72.9737 -79.4699 -81.5068
quadrupole: 0.1075 0.2388 -0.1874
quadrupole: 5.0098 -1.4864 -3.5234 0.1075 0.2388 -0.1874
hfenergy: -555.9454893 hartree
pointgroup: C01 [X(C10H19N3)]
dipole: -0.2583293 1.2519214 0.1416555 debye
polarizability: 150.0916866|3.3238625|135.3207896|-0.9107567|0.0830046|97.7105992 unknown
InChI: InChI=1S/C10H19N3/c1-9(2)13-8-4-7-12-6-3-5-11-10(12)13/h9H,3-8H2,1-2H3
charge 0 multiplicity 1
32 atoms
N  -1.247844 0.795717 -0.01337
N  1.0509 0.119024 -0.105834
N  -0.619881 -1.543143 -0.158458
C  -0.927742 2.234128 -0.077147
C  1.436352 1.49648 0.230885
C  0.521488 2.476564 -0.523209
C  -0.308873 -0.256492 -0.092064
C  -2.687338 0.495642 0.149099
C  2.081648 -0.954506 -0.093479
C  -2.91738 -0.946181 0.633782
C  -2.0501 -1.89853 -0.221181
C  2.67986 -1.149234 1.321375
C  3.174869 -0.709384 -1.156973
H  -1.095179 2.69917 0.92137
H  -1.633455 2.727261 -0.779037
H  2.488011 1.648069 -0.066966
H  1.372298 1.695328 1.326122
H  0.627065 2.301193 -1.60912
H  0.803352 3.524226 -0.310874
H  -3.216843 0.660515 -0.815822
H  -3.112536 1.218512 0.876637
H  1.514871 -1.864944 -0.35718
H  -3.992767 -1.195612 0.563523
H  -2.611468 -1.038471 1.693203
H  -2.160305 -2.941081 0.129927
H  -2.416056 -1.877216 -1.273441
H  3.401155 -1.987489 1.32217
H  3.217051 -0.244533 1.666428
H  1.879531 -1.382431 2.045704
H  2.720869 -0.564431 -2.153178
H  3.848651 -1.584482 -1.206481
H  3.802495 0.173133 -0.925311
