program: Gaussian 09
title: 000145675
version: EM64L-G09RevD.01
frameworkgroup: C1[X(C21H32O2)]
method: RPBEPBE
basis: SDD
operation: Freq
keyword: #pfreq=noraman
keyword: PBEPBE/SDD
title: #p freq=noraman PBEPBE/SDD
converged: YES YES NO NO
title: Mulliken charges:
elementType: O O C C C C C C C C C C C C C C C C C C C C C H H H H H H H H H H H H H H H H H H H H H H H H H H H H H H H H
charge: -0.471205 -0.236513 0.392951 -0.146808 -0.164733 -0.095704 0.352567 -0.538360 0.230653 -0.553490 -0.524456 -0.584157 -0.478473 -0.861749 0.540404 -0.641048 -0.490400 -0.492994 -0.811647 -0.563450 -0.586601 -0.722448 0.178091 0.181743 0.229448 0.199728 0.228864 0.207385 0.220727 0.230162 0.216123 0.223599 0.227218 0.235515 0.226788 0.214421 0.232154 0.229832 0.226153 0.221979 0.235056 0.214217 0.219409 0.218818 0.215790 0.220167 0.229030 0.234203 0.324652 0.245430 0.231059 0.254839 0.213464 0.253176 0.208422
chargesum: 0.00000
title: Mulliken charges with hydrogens summed into heavy atoms:
elementType: O O C C C C C C C C C C C C C C C C C C C C C
charge: -0.146553 -0.236513 0.392951 0.034935 0.064714 0.104025 0.352567 -0.102111 0.230653 -0.102601 -0.084735 -0.121425 -0.037263 -0.173609 0.540404 -0.184013 -0.056774 -0.058386 -0.128247 -0.086961 -0.331762 -0.047386 0.178091
polarizability: 2.96040249e+02 -3.66924828e+00 2.02432068e+02 -1.59552821e+01 -1.00250195e+00 1.77744820e+02
1716.lowfreq: -11.8072 -5.6255 -0.0004 -0.0002 0.0007 12.3817 30.5289 44.7276 70.5741
frequency: 30.4853 44.6897 70.5510 85.3119 105.4314 121.6304 151.7453 163.6990 174.8807 187.0365 197.4893 215.5051 221.3261 228.1359 246.2106 257.7179 263.9962 273.4113 281.6841 289.7655 316.7578 319.0610 349.6085 355.4873 365.5133 382.7201 387.4614 408.1157 426.0453 445.4697 460.7549 482.3982 498.6057 526.6534 530.0261 553.0243 557.0703 605.9699 622.4710 644.0244 670.3733 694.9381 737.4913 773.5542 776.9969 787.2843 804.2613 823.1822 831.6505 854.8947 875.6970 884.6504 906.1952 914.4509 924.3388 934.4975 943.5485 950.0671 960.3622 966.3840 984.9737 993.1884 1005.3317 1016.4519 1025.3780 1031.0658 1044.3214 1063.1035 1070.7120 1073.1978 1088.1900 1108.2208 1114.0685 1115.5960 1122.2196 1131.2936 1135.4397 1149.5959 1163.8393 1181.4589 1185.5485 1187.5897 1203.0906 1207.5416 1219.2653 1231.2125 1236.2953 1248.1953 1262.9078 1266.9094 1278.8595 1280.9936 1282.6195 1286.8872 1297.0083 1306.0105 1314.3574 1319.2956 1324.0953 1325.0227 1334.1158 1343.9762 1345.4200 1351.4366 1352.8974 1356.7712 1370.3338 1386.8674 1388.1745 1398.4909 1443.0085 1453.5245 1454.2397 1460.9632 1464.6448 1466.9710 1468.3648 1474.7708 1476.0774 1477.1599 1481.6159 1487.5504 1490.7078 1492.6823 1500.4983 1584.0961 1622.2003 2875.8905 2912.1985 2951.2215 2959.2511 2969.1348 2972.8757 2974.3776 2980.2332 2981.9266 2982.3892 2984.5631 2985.9685 2988.7431 2990.0251 3009.5742 3029.2871 3032.9138 3038.5250 3041.2480 3042.8153 3046.5532 3047.5580 3061.9837 3068.7614 3070.5485 3074.2700 3077.1044 3078.1706 3081.4703 3102.4253 3116.4677 3561.5646
redmass: 5.5081 3.4860 4.0802 2.7195 2.1635 2.9342 2.6917 3.0957 2.0387 3.8776 1.4321 2.1964 2.1061 1.3811 1.8752 1.5453 1.7227 2.2952 1.4821 2.3495 2.7171 2.9044 2.7384 2.6099 2.9073 2.4515 3.3909 2.7937 3.5334 3.3289 3.0688 2.7401 3.2785 2.7508 2.5302 3.7088 2.5714 3.0560 3.8452 3.5718 3.2990 2.7785 2.7064 2.0989 1.3050 1.8854 2.1834 1.9332 2.3015 2.2563 2.1041 1.4635 1.7437 1.9487 1.9862 1.8003 1.9601 1.7784 2.1847 2.2532 2.2636 2.5169 1.9611 1.7981 1.9244 1.7502 2.0211 2.1092 1.9518 2.2237 2.0636 1.7510 2.4142 1.9917 2.0008 1.9596 1.7530 1.8472 2.1359 1.5375 1.8584 1.8539 2.2819 1.3896 1.5749 1.5053 1.5382 1.3650 1.4017 1.6744 2.0017 1.2764 1.3243 1.4876 1.3950 1.4175 1.5610 1.4962 1.4175 1.3760 1.4748 1.9658 1.5190 1.4516 1.4896 1.8506 1.3875 1.2122 1.2140 1.1972 1.0787 1.0778 1.0861 1.0723 1.0816 1.0768 1.0888 1.0854 1.0501 1.0572 1.0766 1.0602 1.0555 1.0658 1.0580 10.0365 7.7269 1.0798 1.0809 1.0662 1.0733 1.0692 1.0608 1.0641 1.0612 1.0412 1.0479 1.0462 1.0495 1.0579 1.0538 1.0628 1.0993 1.0971 1.0974 1.0997 1.0989 1.1010 1.0998 1.0958 1.0998 1.1020 1.0983 1.0990 1.0989 1.0991 1.0993 1.0911 1.0654
irintensity: 1.9618 1.4480 1.3481 0.7056 2.2365 0.5852 1.1419 1.4860 1.1364 2.5142 0.4368 3.3718 1.6311 8.0804 14.3014 47.5401 42.2088 0.2447 28.0080 2.5563 2.1216 3.0425 3.4513 3.1570 1.0059 3.8535 1.1636 3.4951 1.0464 2.8387 1.7593 0.3420 5.3366 0.6403 0.6466 4.3080 0.4139 3.1078 1.3342 0.3764 8.1900 5.5661 0.7471 5.8794 2.7557 2.8090 0.4809 0.8052 1.5933 8.4139 6.2884 33.1509 8.3090 6.0289 14.5302 21.5297 9.3919 17.8671 12.6725 2.0075 8.1564 3.8942 3.7817 2.8778 6.4483 2.5086 2.2092 7.4712 20.4910 3.7204 1.9206 22.2983 19.9391 3.5486 6.1015 8.4407 8.3962 8.1684 1.5417 11.9201 0.7724 24.6160 1.5905 8.0680 6.1198 20.0729 12.0276 2.4129 1.1943 5.8314 35.0162 3.0029 5.7068 4.0961 1.2241 0.7070 11.3469 6.1020 4.7073 3.7483 0.6083 7.0759 1.3899 3.3950 9.0856 12.1595 1.8912 22.9791 14.4173 27.3504 17.4532 4.7759 20.0302 3.6154 11.0014 4.8708 5.4314 13.7220 9.2089 5.3388 4.8263 8.1019 10.7612 8.8008 4.7155 163.1483 204.4603 24.7758 15.4606 15.2934 9.1063 31.5177 46.1870 14.6510 23.1364 39.4152 23.3375 2.7207 5.2975 53.7796 53.0388 37.5247 13.0305 43.8530 17.2092 70.1905 17.4433 16.0360 32.6303 22.5411 52.6474 62.2013 47.4826 35.8151 10.8521 29.2973 27.3148 11.0921 3.5339
temp: 298.150 k
press: 1.00000 atm
elementType: 8 8 6 6 6 6 6 6 6 6 6 6 6 6 6 6 6 6 6 6 6 6 6 1 1 1 1 1 1 1 1 1 1 1 1 1 1 1 1 1 1 1 1 1 1 1 1 1 1 1 1 1 1 1 1
symmnumber: 1
zpe: 1272597.6 jmol-1
zpe.correction: 0.484707 hartree
zpe.thermalcorrener: 0.507251 hartree
zpe.thermalcorrenthalpy: 0.508195 hartree
zpe.thermalcorrgfe: 0.435587 hartree
zpe.sumelectzpe: -968.086174 hartree
zpe.sumelectthermal: -968.063630 hartree
zpe.sumelectthermalent: -968.062686 hartree
zpe.sumelectthermalfe: -968.135294 hartree
dipole: -3.9259 1.0720 3.1342
dipole: 5.1366
quadrupole: -188.6590 -135.2209 -143.2875
quadrupole: -4.9663 7.3661 -2.7837
quadrupole: -32.9365 20.5016 12.4350 -4.9663 7.3661 -2.7837
hfenergy: -968.5708805 hartree
pointgroup: C01 [X(C21H32O2)]
dipole: -1.548305 0.4031062 1.2346376 debye
polarizability: 296.1507206|-3.7899002|202.4986643|-15.4843967|-0.4161077|177.5677522 unknown
InChI: InChI=1S/C21H32O2/c1-4-21(23)12-9-18-16-6-5-14-13-15(22)7-10-19(14,2)17(16)8-11-20(18,21)3/h13,16-18,23H,4-12H2,1-3H3
charge 0 multiplicity 1
55 atoms
O  -3.646794 -0.307454 -1.862827
O  6.106103 -0.117144 -1.253376
C  -2.34156 -0.411499 0.292505
C  -1.52773 0.859024 -0.110687
C  -0.09245 0.892627 0.455282
C  0.664454 -0.386049 -0.031029
C  -3.733188 -0.089093 -0.390203
C  -1.596345 -1.657514 -0.236046
C  2.172106 -0.451591 0.460232
C  -2.495267 2.032321 0.194682
C  -0.129156 -1.690214 0.274421
C  -3.920312 1.441413 -0.091522
C  0.661327 2.162961 0.004936
C  -2.530683 -0.517264 1.831908
C  2.863421 0.882607 0.123281
C  2.128253 2.15627 0.497572
C  -4.910698 -0.983757 0.041394
C  2.886047 -1.621504 -0.2875
C  2.268779 -0.671475 2.004336
C  4.425814 -1.568529 -0.21395
C  4.109912 0.948072 -0.448204
C  -6.247417 -0.629544 -0.645577
C  4.965963 -0.226961 -0.70518
H  -1.394169 0.814114 -1.219768
H  -0.142172 0.896926 1.56501
H  0.717208 -0.295048 -1.141998
H  -1.613591 -1.645174 -1.342945
H  -2.11166 -2.587129 0.078066
H  -2.283514 2.924705 -0.42042
H  -2.401544 2.340597 1.253625
H  -0.127472 -1.883149 1.364376
H  0.382072 -2.551431 -0.194379
H  -4.58814 1.587012 0.776802
H  -4.411846 1.926635 -0.953566
H  0.149981 3.067468 0.385672
H  0.645019 2.222824 -1.10335
H  -3.138597 0.309145 2.241204
H  -3.034982 -1.465506 2.090866
H  -1.564721 -0.508913 2.36501
H  2.121256 2.249716 1.60496
H  2.675816 3.035345 0.11134
H  -5.031837 -0.915771 1.13816
H  -4.648764 -2.034086 -0.194613
H  2.58347 -1.591101 -1.354212
H  2.535867 -2.588191 0.118377
H  1.721359 0.103575 2.569115
H  1.852878 -1.654411 2.287687
H  3.321416 -0.641979 2.337897
H  -3.001096 0.338704 -2.245622
H  4.888068 -2.376162 -0.808758
H  4.771441 -1.708903 0.830773
H  4.554542 1.920328 -0.699266
H  -6.577458 0.39473 -0.389854
H  -6.144092 -0.692341 -1.741316
H  -7.044317 -1.326636 -0.327121
