program: Gaussian 09
title: 000145696
version: EM64L-G09RevD.01
frameworkgroup: C1[X(C21H34O4)]
method: RPBEPBE
basis: SDD
operation: Freq
keyword: #pfreq=noraman
keyword: PBEPBE/SDD
title: #p freq=noraman PBEPBE/SDD
converged: YES YES NO NO
title: Mulliken charges:
elementType: O O O O C C C C C C C C C C C C C C C C C C C C C H H H H H H H H H H H H H H H H H H H H H H H H H H H H H H H H H H
charge: -0.243852 -0.210357 -0.244836 -0.237593 -0.386206 -0.385776 -0.386130 -0.384889 -0.391387 -0.381905 -0.373118 -0.372822 -0.392203 -0.353400 -0.510666 -0.356657 0.315482 -0.696863 0.047921 -0.088243 0.286742 0.108094 -0.491228 -0.494054 -0.492041 0.194370 0.192828 0.193861 0.192787 0.192814 0.195216 0.192477 0.193194 0.197150 0.193650 0.191958 0.191500 0.199088 0.192975 0.189376 0.189060 0.215843 0.215930 0.187625 0.187444 0.239479 0.223356 0.194739 0.194591 0.209672 0.209573 0.214751 0.280794 0.225109 0.246771 0.251330 0.229357 0.248776 0.248541
chargesum: 0.00000
title: Mulliken charges with hydrogens summed into heavy atoms:
elementType: O O O O C C C C C C C C C C C C C C C C C C C C C
charge: -0.243852 -0.210357 -0.244836 -0.237593 0.000992 0.000872 0.001900 0.000782 -0.000587 0.001553 0.018945 0.005613 0.039571 0.021669 -0.047831 0.032673 0.315482 -0.062868 0.047921 -0.088243 0.286742 0.108094 -0.210434 0.229156 0.234634
polarizability: 3.01855053e+02 4.32980701e-01 2.92200257e+02 1.92126041e+01 -1.06023059e+01 1.79409305e+02
1716.lowfreq: -0.0021 0.0008 0.0012 4.1848 5.8575 7.3176 11.7250 19.9850 22.1426
frequency: 11.3721 19.9789 22.0633 35.2042 40.4625 41.6226 46.2521 57.6246 62.8305 76.9524 78.7897 83.2777 96.4163 103.9540 113.3874 129.0558 130.9969 141.0976 155.9371 159.6498 160.9847 176.2453 203.5538 212.5366 214.9048 227.3046 229.3144 252.9630 273.6938 302.1549 311.2878 330.2027 351.5891 372.3574 388.9367 394.7767 425.9010 431.5099 438.2997 466.1277 487.3472 494.2655 542.8143 614.0814 656.4270 695.5192 719.5702 720.7922 721.2083 723.9256 730.5792 743.8226 765.6040 791.0060 797.7064 825.2843 859.4170 861.8854 886.9561 887.9346 902.3642 945.5639 969.2608 976.0627 984.8026 989.6898 1000.8190 1014.7448 1029.6071 1032.1024 1037.3285 1058.6353 1073.1841 1076.5524 1080.5705 1081.5073 1086.2379 1101.0194 1102.0849 1111.1744 1123.6466 1139.7847 1140.6780 1180.5784 1194.7505 1199.0321 1200.1759 1218.7034 1224.6811 1226.3738 1247.4738 1251.4082 1265.5093 1274.3634 1278.0168 1279.2436 1284.5944 1289.7863 1292.3573 1295.5045 1298.6459 1299.4720 1302.2278 1311.5505 1319.9227 1333.9145 1345.1743 1351.3988 1354.3208 1354.6681 1357.8659 1358.4527 1387.6618 1437.7132 1438.4428 1446.2174 1447.1763 1450.0366 1450.2710 1450.8443 1459.1846 1459.4490 1461.6189 1462.2246 1464.0690 1465.9423 1469.8749 1474.4481 1476.0354 1479.0626 1483.3502 1486.7440 1488.7776 1508.2666 1533.6514 1569.0922 1621.3409 2948.0058 2948.0687 2949.6066 2949.9521 2951.4396 2952.4405 2955.7170 2959.8763 2963.8500 2967.8031 2970.6988 2976.4327 2980.8106 2983.0096 2986.4145 2991.2515 2997.7254 3003.6695 3005.8782 3010.5732 3011.5615 3015.1777 3024.4556 3032.7336 3039.4330 3043.7136 3067.3240 3069.4493 3072.4121 3126.6448 3126.8004 3134.3766 3136.8527 3180.5064
redmass: 4.8096 4.4818 4.0353 1.6416 3.6934 4.6627 3.3349 4.2805 1.6266 3.8404 2.9336 4.3793 1.7502 4.4336 2.2827 2.3046 2.8490 2.0438 2.0131 2.0808 4.7000 3.1429 3.6614 1.1233 1.3810 1.1268 2.9712 3.1397 4.5344 3.4785 3.7818 6.2714 4.0633 6.3672 3.9060 4.3557 5.4750 3.5274 6.8506 6.2091 3.7170 3.1548 4.7626 5.5081 6.3617 3.0441 1.0579 1.0753 7.0899 1.0859 1.1364 1.1954 1.2748 4.7864 1.4579 1.7591 1.4916 1.7037 7.3729 1.9004 1.3851 1.4288 5.9442 2.1516 4.7311 4.9140 1.3850 4.1994 3.4962 1.1281 3.2993 3.0387 2.6808 2.4366 2.1397 2.1793 2.6129 1.2393 1.2404 1.4833 2.9151 1.4919 1.5020 1.9057 2.1757 1.2877 1.6430 3.6129 1.6109 1.3037 1.4284 1.2978 1.5306 1.3205 1.1463 1.2521 1.0346 1.2690 1.0806 1.2062 1.1688 1.2107 1.2849 4.1519 1.4262 1.4126 1.4830 2.5879 1.8113 1.7984 1.6571 1.6441 1.2178 1.1824 1.1804 1.1015 1.0732 1.0536 1.0562 1.1418 1.0752 1.0749 1.0749 1.0703 1.0621 1.0826 1.0853 1.0865 1.0426 1.0893 1.0928 1.0950 1.0940 7.7126 8.5948 8.6328 8.0245 1.0587 1.0586 1.0590 1.0591 1.0594 1.0594 1.0594 1.0590 1.0585 1.0583 1.0368 1.0585 1.0961 1.0968 1.0981 1.0997 1.1015 1.0586 1.1028 1.0276 1.0277 1.1042 1.1047 1.1047 1.1045 1.1043 1.1007 1.0993 1.1043 1.1050 1.1051 1.1069 1.1069 1.0923
irintensity: 0.0150 0.0093 0.0593 0.0111 7.8463 2.8156 1.2168 0.3728 0.0233 0.1638 0.0464 0.4396 0.0344 2.9485 0.0823 0.2793 0.6115 0.0092 0.0026 0.3775 9.0398 0.1006 3.0624 0.3418 0.3201 0.0042 2.0458 0.1981 1.9525 0.2236 0.1408 0.4613 1.1411 4.2002 0.7328 2.6348 33.8252 0.3021 0.8250 0.4913 0.1906 0.2363 4.5185 0.7315 26.4085 0.7703 19.6352 0.0158 0.3203 6.4870 0.0579 1.3745 0.4027 11.0570 1.9793 4.8181 5.6055 34.7454 1.9518 4.8780 1.5285 6.6119 12.8938 34.8402 1.4075 28.6719 16.5391 29.7510 2.2824 2.0489 17.0915 3.8236 1.8356 1.1045 0.2178 0.0347 3.3902 0.1157 0.0478 3.5786 15.6265 7.0381 12.7231 0.1840 285.8362 29.2087 71.1725 9.0653 9.5176 1.0144 21.3314 1.8726 40.3382 3.8199 4.7943 14.2056 0.6236 5.6801 3.2139 0.9051 2.9856 0.8421 3.0536 187.0031 26.8570 2.6723 0.7043 5.0692 0.4017 0.4706 0.2217 0.2829 11.0796 22.1388 3.9100 32.9610 80.3874 10.9364 16.7095 19.3157 0.0395 0.2734 0.1438 0.2624 0.0441 0.4134 1.3210 1.3867 12.2361 2.0095 2.7523 6.4068 38.7851 20.3820 266.8569 293.8177 56.2380 0.0014 0.0086 0.1143 0.5619 0.5123 0.2447 5.8494 0.3988 138.9636 198.6313 36.5280 46.3183 0.1754 0.1266 0.1332 0.1095 0.2437 35.2338 0.7030 50.0243 28.4391 0.1219 4.5957 1.3834 35.2579 293.6796 99.2704 55.7997 21.8852 22.7688 18.3048 32.7145 32.9738 0.4329
temp: 298.150 k
press: 1.00000 atm
elementType: 8 8 8 8 6 6 6 6 6 6 6 6 6 6 6 6 6 6 6 6 6 6 6 6 6 1 1 1 1 1 1 1 1 1 1 1 1 1 1 1 1 1 1 1 1 1 1 1 1 1 1 1 1 1 1 1 1 1 1
symmnumber: 1
zpe: 1333545.9 jmol-1
zpe.correction: 0.507921 hartree
zpe.thermalcorrener: 0.538198 hartree
zpe.thermalcorrenthalpy: 0.539142 hartree
zpe.thermalcorrgfe: 0.441215 hartree
zpe.sumelectzpe: -1119.501079 hartree
zpe.sumelectthermal: -1119.470801 hartree
zpe.sumelectthermalent: -1119.469857 hartree
zpe.sumelectthermalfe: -1119.567784 hartree
dipole: 0.6862 -0.2142 0.3439
dipole: 0.7969
quadrupole: -166.2114 -141.2797 -156.5741
quadrupole: 11.0100 -5.2119 4.8557
quadrupole: -11.5230 13.4087 -1.8857 11.0100 -5.2119 4.8557
hfenergy: -1120.0089995 hartree
pointgroup: C01 [X(C21H34O4)]
dipole: 0.2710754 -0.0840547 0.1332667 debye
polarizability: 301.9860095|0.223715|292.4558705|18.8500855|-9.0201342|179.0227352 unknown
InChI: InChI=1S/C21H34O4/c1-4-5-6-7-8-9-10-11-12-13-14-15-17-20(23)19(24-2)16-18(22)21(17)25-3/h16H,4-15H2,1-3H3
charge 0 multiplicity 1
59 atoms
O  -3.915835 2.392151 0.422146
O  -4.266733 -2.33963 0.642002
O  -6.835508 -2.298352 -0.735673
O  -6.484444 2.412308 -0.962582
C  3.59308 -0.051444 -0.203657
C  4.956815 -0.05147 0.523194
C  2.38525 -0.057418 0.760144
C  6.165575 -0.040075 -0.439438
C  1.021048 -0.048119 0.033982
C  7.52882 -0.035142 0.288371
C  -0.184749 -0.043729 1.000227
C  8.73815 -0.021797 -0.673688
C  -1.545687 -0.017011 0.271012
C  10.101412 -0.014806 0.054195
C  -2.744695 -0.003201 1.26231
C  11.310404 -0.001324 -0.908966
C  -4.081651 0.051662 0.555091
C  12.668494 0.006227 -0.174187
C  -4.644403 1.253801 0.143702
C  -4.76876 -1.217851 0.283474
C  -6.104971 -1.171618 -0.439781
C  -5.974264 1.301277 -0.582944
C  -6.643401 0.034647 -0.833394
C  -4.379102 3.772665 0.138562
C  -6.421894 -3.681725 -0.393714
H  3.533782 -0.936417 -0.871517
H  3.530455 0.839376 -0.863562
H  5.020881 -0.943437 1.18131
H  5.014109 0.832249 1.193043
H  2.448166 0.825218 1.430924
H  2.444515 -0.950571 1.416952
H  6.099908 0.850629 -1.099214
H  6.110375 -0.925087 -1.107675
H  0.954326 -0.933306 -0.632537
H  0.96453 0.842747 -0.626221
H  7.595011 -0.926133 0.947636
H  7.583278 0.849482 0.957233
H  -0.135922 -0.939422 1.654018
H  -0.112671 0.837574 1.671818
H  8.684577 -0.90703 -1.34186
H  8.671343 0.868706 -1.333684
H  -1.60125 0.878731 -0.378572
H  -1.631321 -0.903588 -0.388185
H  10.170093 -0.905204 0.714082
H  10.156723 0.870498 0.722129
H  -2.705886 -0.91936 1.878548
H  -2.64468 0.874819 1.926412
H  11.254237 -0.886178 -1.575704
H  11.240527 0.888224 -1.568169
H  12.776724 -0.888716 0.467519
H  12.762188 0.896834 0.475793
H  13.51518 0.016396 -0.885275
H  -7.602581 0.071873 -1.356415
H  -3.567107 4.397903 0.540792
H  -5.333448 3.981192 0.646738
H  -4.508042 3.928865 -0.943281
H  -7.251255 -4.293769 -0.779601
H  -6.308781 -3.801056 0.694903
H  -5.47104 -3.940568 -0.88446
