program: Gaussian 09
title: 000145637
version: EM64L-G09RevD.01
frameworkgroup: C1[X(C11H12N2)]
method: RPBEPBE
basis: SDD
operation: Freq
keyword: #pfreq=noraman
keyword: PBEPBE/SDD
title: #p freq=noraman PBEPBE/SDD
converged: YES YES NO NO
title: Mulliken charges:
elementType: N N C C C C C C C C C C C H H H H H H H H H H H H
charge: -0.437714 -0.087806 0.447144 -0.515719 0.071894 -0.538636 0.345737 -0.665440 -0.376023 -0.369849 -0.247638 -0.232981 -0.242561 0.222456 0.235172 0.249349 0.321083 0.232982 0.226547 0.202925 0.219314 0.268181 0.222227 0.223462 0.225892
chargesum: 0.00000
title: Mulliken charges with hydrogens summed into heavy atoms:
elementType: N N C C C C C C C C C C C
charge: -0.116631 -0.087806 0.447144 -0.058091 0.071894 -0.289287 0.345737 -0.002986 -0.156709 -0.101668 -0.025410 -0.009519 -0.016669
polarizability: 2.11143074e+02 -3.26178730e+00 1.25444162e+02 5.63143713e+00 1.59447532e+00 6.45806445e+01
1716.lowfreq: -8.7329 -3.9746 0.0004 0.0005 0.0006 2.5501 23.2741 31.1030 85.2161
frequency: 22.7422 31.0642 85.2133 116.6170 152.1191 202.4989 263.1133 293.3371 334.3055 399.9725 402.2784 467.5022 505.4748 596.9594 615.8811 626.0146 672.7889 690.8332 698.4499 700.8054 775.6062 780.9314 829.0648 853.4843 927.6379 932.1212 955.0178 979.2971 988.8453 999.1975 1019.1117 1023.3185 1040.1410 1056.2256 1071.1249 1077.7985 1134.4618 1171.2859 1188.0077 1199.9433 1234.1644 1284.1570 1314.0321 1317.2293 1367.5325 1382.6758 1396.1450 1411.2023 1431.6168 1448.8934 1472.0760 1477.2489 1483.3357 1516.3898 1567.4289 1589.0846 1619.9684 2979.2242 2984.4896 3050.5568 3080.6240 3092.6848 3121.1031 3129.8068 3143.1574 3155.4551 3166.6975 3229.3069 3611.2548
redmass: 2.5647 3.8636 3.8535 3.1536 3.2393 1.3167 3.6691 3.3842 3.6204 4.8204 2.8841 3.8441 3.7096 1.8736 5.5469 2.2932 3.0721 2.3683 3.2271 2.6071 1.1968 1.7824 1.5874 1.2551 1.4712 7.4802 2.5558 1.3723 6.2175 1.3293 2.8020 2.8949 1.6821 2.2713 1.7403 1.6949 2.6186 1.0562 1.1329 2.1216 1.5396 1.9867 1.4001 1.4494 2.3335 4.8341 1.2553 3.2782 2.5693 2.5921 1.0848 1.0452 1.0801 3.7769 4.8804 6.0411 6.1024 1.0651 1.0370 1.0951 1.0991 1.1010 1.0844 1.0879 1.0933 1.0962 1.1002 1.0986 1.0817
irintensity: 0.0605 0.5204 1.8624 1.9962 0.5394 0.4748 0.8172 0.0290 0.2647 1.0225 0.0656 2.4291 9.7168 31.7344 2.2987 24.7859 23.7888 33.1152 10.1927 27.9179 13.8827 65.3438 31.8631 1.3778 6.2835 13.6731 4.7119 0.0772 0.6410 0.8234 8.5417 5.0260 8.4772 1.9960 3.3788 15.7097 15.8620 0.1290 0.6134 7.0122 3.8560 15.4219 4.2694 13.9861 0.9199 1.1907 9.8658 11.1805 22.1474 22.8960 4.2716 16.2278 10.1620 8.6278 36.6384 3.9737 12.1354 36.1472 35.3616 3.1920 55.4928 39.5082 3.4023 5.5848 36.7221 26.6205 17.1352 1.2851 69.0156
temp: 298.150 k
press: 1.00000 atm
elementType: 7 7 6 6 6 6 6 6 6 6 6 6 6 1 1 1 1 1 1 1 1 1 1 1 1
symmnumber: 1
zpe: 537949.5 jmol-1
zpe.correction: 0.204894 hartree
zpe.thermalcorrener: 0.216387 hartree
zpe.thermalcorrenthalpy: 0.217331 hartree
zpe.thermalcorrgfe: 0.165517 hartree
zpe.sumelectzpe: -534.937981 hartree
zpe.sumelectthermal: -534.926488 hartree
zpe.sumelectthermalent: -534.925544 hartree
zpe.sumelectthermalfe: -534.977358 hartree
dipole: -3.1984 -0.9307 -0.1530
dipole: 3.3345
quadrupole: -57.9413 -70.4965 -82.3523
quadrupole: -2.3834 1.6653 0.0555
quadrupole: 12.3221 -0.2331 -12.0890 -2.3834 1.6653 0.0555
hfenergy: -535.1428749 hartree
pointgroup: C01 [X(C11H12N2)]
dipole: 1.2575083 -0.3526058 0.1242562 debye
dipolederiv: -0.773796 -0.2398434 0.0336548 -0.1720745 -0.2095242 -0.0015608 0.0190792 -0.015002 -0.2164454 0.077468 0.2144531 -0.0209466 0.1578331 -0.3726228 0.0489506 -0.0221538 0.0539207 -0.2164969 0.2720701 0.0034191 0.0081549 0.1066466 0.2777164 -0.0625118 0.0468151 -0.089742 -0.0343456 0.1027054 0.0400365 0.0236116 -0.0710748 0.1225868 0.0263977 0.0739781 0.02636 0.1377312 0.3898383 -0.0304913 0.0319837 -0.2324198 0.0813838 -0.0401417 0.0737864 -0.0139083 0.0284787 -0.4193221 0.001611 0.0041903 0.0427045 -0.092462 -0.0441698 -0.0245287 -0.0396572 -0.23062 0.4824871 0.0468319 0.0060927 0.1049244 -0.001855 0.0135303 -0.0028695 0.0106446 0.0344225 -0.0233921 0.011791 0.0312437 0.0344428 0.0745825 0.0086861 -0.0441249 0.0174227 0.0012441 -0.1480825 -0.0644075 0.0186842 -0.143067 -0.0051357 -0.0472023 0.0377403 -0.0443421 -0.1491349 -0.2277367 0.0473035 -0.0124788 0.1014886 0.0152013 -0.0377712 -0.0308606 -0.0411112 -0.1425349 -0.005342 0.0625275 -0.0081056 0.1316317 0.0932581 -0.059943 -0.0254703 -0.0624758 -0.1447551 0.060781 -0.0887443 0.033432 -0.1213818 0.0685789 -0.0639945 0.0423905 -0.0624507 -0.1356026 -0.0192602 0.0127512 0.0067512 -0.0071021 -0.0733351 -0.0269079 0.0095731 -0.0263889 -0.1692999 -0.0870826 -0.0077033 -0.0652885 -0.0476615 0.0233626 -0.1180054 -0.084991 -0.0715672 -0.0646233 0.0348234 -0.0399137 0.0352824 0.0349672 -0.0984093 0.0907091 0.025653 0.0582883 0.0539044 0.1309991 -0.0210356 0.0004431 -0.0111929 -0.0228065 0.0577488 -0.0006553 0.0565295 0.1749027 0.184674 -0.0146497 -0.0086764 0.0371487 0.2432549 0.0308857 -0.0297697 0.033872 0.3040272 0.081006 -0.0727675 -0.0800091 -0.0497401 0.0274349 -0.0981767 -0.0300541 -0.0798128 -0.0592306 -0.2241609 0.0930775 -0.0063876 0.1066989 0.073347 0.0137321 -0.012531 0.0198623 0.071047 0.1079798 0.0108396 0.0178496 -0.0371496 -0.153255 0.0876801 0.028258 0.0470474 0.041735 0.0258743 0.111334 -0.0359575 0.1050493 -0.0245874 0.0487602 -0.0338103 0.0501346 0.1311025 0.1148363 -0.0706489 0.0148698 -0.0561079 -0.0059467 0.0391064 0.0122049 0.037895 0.1443998 0.0292035 -0.074738 0.0132396 -0.1069973 -0.0872253 0.0589434 0.0212704 0.0599775 0.1432132 -0.0145285 0.0940401 -0.0325308 0.1194835 -0.0450665 0.057812 -0.0397921 0.0569444 0.1381215 -0.1520425 -0.0250726 -0.0091029 -0.0270498 0.0915244 0.0174428 -0.0091374 0.0175592 0.1587593 unknown
polarizability: 211.3097322|3.5472149|121.5081916|2.5933154|-15.028444|68.3499565 unknown
InChI: InChI=1S/C11H12N2/c1-2-10-8-11(13-12-10)9-6-4-3-5-7-9/h3-8,12H,2H2,1H3
charge 0 multiplicity 1
25 atoms
N  2.165752 1.13535 -0.068946
N  0.805388 1.363806 -0.207484
C  2.4793 -0.166156 0.302964
C  3.894904 -0.641851 0.506372
C  0.233128 0.14752 0.090636
C  1.244435 -0.823373 0.411313
C  -1.233222 -0.015334 0.054926
C  4.773942 -0.542312 -0.769105
C  -1.839603 -1.266373 0.349419
C  -2.070899 1.086158 -0.276054
C  -3.24297 -1.413239 0.315092
C  -3.471912 0.937769 -0.3100
C  -4.067171 -0.312522 -0.014512
H  4.375314 -0.071396 1.326982
H  3.855718 -1.69283 0.842837
H  1.103517 -1.865719 0.688009
H  2.805421 1.907526 -0.242724
H  4.332596 -1.12633 -1.595624
H  5.788792 -0.931696 -0.571895
H  4.877774 0.503226 -1.113914
H  -1.214904 -2.129261 0.606518
H  -1.602534 2.049195 -0.50248
H  -3.693274 -2.385627 0.545097
H  -4.102736 1.796628 -0.566431
H  -5.156657 -0.426762 -0.040798
