program: Gaussian 09
title: 000145618
version: EM64L-G09RevD.01
frameworkgroup: C1[X(C18H22N4)]
method: RPBEPBE
basis: SDD
operation: Freq
keyword: #pfreq=noraman
keyword: PBEPBE/SDD
title: #p freq=noraman PBEPBE/SDD
converged: NO YES NO NO
title: Mulliken charges:
elementType: N N N N C C C C C C C C C C C C C C C C C C H H H H H H H H H H H H H H H H H H H H H H
charge: -0.121701 -0.121862 -0.091337 -0.091225 0.230658 0.230913 -0.750816 -0.751999 -0.751822 -0.752004 0.167212 0.167459 -0.300065 -0.300231 -0.339733 -0.339840 -0.201893 -0.201979 -0.204063 -0.204035 -0.236331 -0.236340 0.219208 0.243265 0.237183 0.224255 0.233834 0.230263 0.243410 0.237192 0.219108 0.224383 0.230369 0.233254 0.268430 0.268517 0.252747 0.252801 0.228697 0.228714 0.231705 0.231693 0.231008 0.231001
chargesum: 0.00000
title: Mulliken charges with hydrogens summed into heavy atoms:
elementType: N N N N C C C C C C C C C C C C C C C C C C
charge: -0.121701 -0.121862 -0.091337 -0.091225 0.230658 0.230913 -0.051161 -0.063648 -0.052113 -0.063997 0.167212 0.167459 -0.031635 -0.031714 -0.086987 -0.087039 0.026804 0.026735 0.027642 0.027658 -0.005323 -0.005339
polarizability: 4.14284149e+02 2.12983565e+01 1.66961367e+02 -9.75277691e-01 4.12784434e-01 1.73298474e+02
1716.lowfreq: -13.4480 -1.3102 -0.0005 0.0003 0.0007 5.4137 12.1609 19.8776 22.1696
frequency: 11.7351 19.5592 21.8311 28.8850 72.2728 90.2946 92.7909 97.1757 112.4931 180.7520 193.4458 206.7132 207.2934 248.2284 252.2927 255.0235 267.6234 279.2811 282.5109 303.5810 333.4259 372.1740 379.5312 386.1900 407.2002 407.6794 436.6669 480.8929 482.6053 523.8620 535.3846 543.5735 551.8088 604.6980 609.6533 610.6294 652.8230 695.5126 696.3196 723.1849 781.2157 781.7964 808.9819 818.0526 850.4869 856.0436 856.5256 865.9581 908.0525 930.2322 934.2894 943.8744 944.5163 963.1839 987.2463 987.3555 988.4385 988.8182 990.2865 1000.5296 1001.7440 1002.1552 1015.3241 1015.6743 1074.5453 1075.1714 1115.7937 1130.0339 1152.1130 1156.1562 1159.7667 1170.3209 1170.3290 1182.4193 1192.7233 1196.0553 1221.5518 1232.5907 1304.1683 1304.7397 1358.8067 1366.0302 1381.2246 1385.6926 1388.7311 1389.5442 1420.8998 1423.9929 1445.0559 1446.4560 1452.4533 1454.2220 1463.1796 1465.2885 1465.7906 1468.0668 1474.9353 1477.6734 1481.0027 1503.1407 1587.7767 1587.8530 1604.6566 1604.6907 2993.1768 2994.9997 3000.3196 3003.3416 3088.7006 3094.1315 3097.0272 3100.5291 3104.2825 3107.4953 3107.9575 3108.6823 3127.6805 3128.0671 3138.9060 3139.4480 3151.9712 3152.3659 3163.1916 3163.5377 3170.5855 3170.9943
redmass: 3.9270 3.5364 4.6618 5.0685 4.5477 5.5192 4.5009 4.3129 2.7882 1.2893 1.9993 2.5227 1.7333 1.6604 3.2561 1.2090 3.0624 4.9137 3.1142 1.8114 3.5130 2.1449 2.6134 3.2343 2.8870 2.8918 4.2356 3.6818 3.2670 5.7238 4.0181 4.6211 3.5485 4.6708 6.4764 6.4294 3.7769 1.8862 1.8805 3.2243 1.7361 1.7249 3.8719 3.2197 3.9337 1.2464 1.2451 5.2729 3.6621 1.4573 1.5962 1.4341 1.4301 1.8258 5.8523 6.1117 1.3953 1.3778 1.2827 1.3432 1.3245 1.3332 2.0606 2.0743 1.4719 1.4760 2.0961 2.6060 2.2969 1.6534 1.9847 1.0600 1.0601 1.7739 2.0294 2.4358 4.4602 3.3615 1.3666 1.3676 1.2108 1.1952 1.2387 1.4542 9.1174 4.1777 5.2722 4.8926 2.4113 2.7445 1.0619 1.0876 1.1197 1.9981 1.9938 1.1298 1.0576 1.0536 1.0559 1.0581 6.2748 6.2984 6.3823 6.3743 1.0339 1.0343 1.0355 1.0358 1.1008 1.0995 1.0999 1.0995 1.0989 1.0995 1.0983 1.1000 1.0851 1.0851 1.0886 1.0886 1.0926 1.0926 1.0955 1.0955 1.1008 1.1008
irintensity: 0.0202 0.0527 0.1834 0.5854 0.0627 0.6543 0.9246 0.1588 1.8075 1.9867 0.8047 2.7865 2.2931 0.0422 2.8787 0.0200 0.2043 0.3031 0.0051 0.1290 3.3286 0.0153 1.2293 0.6385 0.0158 0.0120 9.9835 10.7231 8.5126 0.0109 1.2002 27.7709 6.4903 0.7859 1.3615 0.1463 8.0234 44.2706 46.4076 0.0249 72.0682 52.9038 7.8478 0.8886 9.3081 0.2486 0.1725 0.1896 7.4656 3.8028 3.7637 4.8656 6.0777 0.0361 2.0443 0.8758 0.0797 0.0782 0.0092 0.9395 0.5865 1.4537 11.5023 8.0786 10.6982 11.2639 243.6094 5.8258 3.1122 14.7152 17.1807 0.0580 0.2885 0.0198 1.2578 0.1526 20.8689 0.7528 3.1269 4.0396 10.0101 43.2794 43.1208 7.5370 7.7887 5.6887 13.3072 4.4498 10.8300 6.3596 6.6130 4.8872 0.6129 6.0832 26.9564 1.4702 12.7776 6.0006 22.0254 0.4413 2.8232 1.8299 0.4111 0.2854 16.0429 30.6411 21.7117 6.1287 25.1331 7.2572 26.8663 11.5245 41.0702 43.8681 22.5716 16.4115 1.0325 0.9033 9.3074 9.4149 18.2457 17.0448 18.0959 18.3164 39.3038 22.8007
temp: 298.150 k
press: 1.00000 atm
elementType: 7 7 7 7 6 6 6 6 6 6 6 6 6 6 6 6 6 6 6 6 6 6 1 1 1 1 1 1 1 1 1 1 1 1 1 1 1 1 1 1 1 1 1 1
symmnumber: 1
zpe: 945776.1 jmol-1
zpe.correction: 0.360227 hartree
zpe.thermalcorrener: 0.381993 hartree
zpe.thermalcorrenthalpy: 0.382937 hartree
zpe.thermalcorrgfe: 0.306874 hartree
zpe.sumelectzpe: -916.424271 hartree
zpe.sumelectthermal: -916.402506 hartree
zpe.sumelectthermalent: -916.401561 hartree
zpe.sumelectthermalfe: -916.477624 hartree
dipole: 0.0046 0.0079 0.2821
dipole: 0.2822
quadrupole: -99.4097 -129.6850 -128.0657
quadrupole: 4.8999 -0.2286 0.0977
quadrupole: 19.6438 -10.6315 -9.0123 4.8999 -0.2286 0.0977
hfenergy: -916.7844983 hartree
pointgroup: C01 [X(C18H22N4)]
dipole: 0.001839 0.1109527 0.0038757 debye
polarizability: 413.2530453|0.4740719|173.3255927|-26.6143515|-0.029137|167.9653524 unknown
InChI: InChI=1S/C18H22N4/c1-17(2,21-19-15-11-7-5-8-12-15)18(3,4)22-20-16-13-9-6-10-14-16/h5-14H,1-4H3
charge 0 multiplicity 1
44 atoms
N  1.87903 0.396668 0.097079
N  -1.879837 0.404826 -0.091154
N  2.702139 -0.410966 0.682074
N  -2.701792 -0.393795 -0.690053
C  0.469874 0.357958 0.645557
C  -0.470909 0.378678 -0.64062
C  0.340798 1.669069 1.474083
C  0.167366 -0.856058 1.550701
C  -0.3374 1.713194 -1.429579
C  -0.171911 -0.80905 -1.581397
C  4.067834 -0.337701 0.204229
C  -4.066865 -0.332932 -0.208511
C  4.540552 0.582294 -0.771162
C  -4.539694 0.567466 0.784921
C  4.956974 -1.270156 0.793527
C  -4.954792 -1.256735 -0.81304
C  5.897025 0.556313 -1.14797
C  -5.895204 0.53076 1.164339
C  6.31528 -1.292478 0.409115
C  -6.312074 -1.290043 -0.425807
C  6.787731 -0.37931 -0.561942
C  -6.784673 -0.396361 0.563165
H  0.909777 1.566654 2.414992
H  -0.721008 1.851766 1.709136
H  0.741752 2.536591 0.923985
H  0.293495 -1.813891 1.01898
H  0.853397 -0.870754 2.413085
H  -0.871289 -0.784743 1.917809
H  0.725416 1.900995 -1.655993
H  -0.739133 2.564872 -0.855859
H  -0.903198 1.639758 -2.375152
H  -0.304627 -1.782098 -1.0798
H  0.86812 -0.731642 -1.943349
H  -0.855491 -0.79388 -2.445741
H  3.836293 1.296713 -1.209144
H  -3.836273 1.275479 1.234506
H  4.560347 -1.962041 1.544095
H  -4.557982 -1.933472 -1.577192
H  6.268927 1.26376 -1.897881
H  -6.267326 1.223084 1.928118
H  7.001159 -2.015065 0.864299
H  -6.997038 -2.00607 -0.892593
H  7.841977 -0.392183 -0.860564
H  -7.83815 -0.417774 0.86401
