program: Gaussian 09
title: 000145613
version: EM64L-G09RevD.01
frameworkgroup: C1[X(C8H3F4N)]
method: RPBEPBE
basis: SDD
operation: Freq
keyword: #pfreq=noraman
keyword: PBEPBE/SDD
title: #p freq=noraman PBEPBE/SDD
converged: YES YES NO YES
title: Mulliken charges:
elementType: F F F F N C C C C C C C C H H H
charge: -0.158165 -0.148625 -0.148680 -0.161852 0.021759 0.202163 0.156239 -0.376243 0.278990 0.230776 -0.165271 -0.349511 -0.193066 0.280410 0.254378 0.276698
chargesum: 0.00000
title: Mulliken charges with hydrogens summed into heavy atoms:
elementType: F F F F N C C C C C C C C
charge: -0.158165 -0.148625 -0.148680 -0.161852 0.021759 0.202163 0.156239 -0.095833 0.278990 0.230776 0.089107 -0.072813 -0.193066
polarizability: 9.89237613e+01 7.77790639e+00 1.25994536e+02 2.37235799e-04 7.69053402e-04 4.29555351e+01
1716.lowfreq: -7.2775 -0.0013 -0.0003 0.0006 7.1036 11.6876 32.7055 79.6076 120.6331
frequency: 32.2520 79.5999 120.6329 145.5408 178.6897 232.9005 299.1503 299.6663 311.6765 386.3674 414.4469 450.1405 468.7205 494.0690 556.9990 562.3160 608.9204 611.8857 642.5293 742.1490 776.5471 809.2420 860.1956 920.2080 987.9486 1000.6253 1013.2540 1067.0589 1090.3350 1176.5915 1206.5316 1237.7868 1288.7666 1377.4103 1448.5115 1466.5590 1580.9481 1613.4616 2195.7107 3164.6444 3183.9813 3194.1635
redmass: 14.6099 11.4930 14.6140 7.5488 13.0144 6.0219 11.9585 8.6907 15.3229 9.6781 7.1739 11.4018 8.2680 13.7026 9.4710 4.2292 7.1252 7.1399 13.6290 3.1068 6.7954 1.6493 9.4434 1.3813 1.4247 7.4291 6.9174 3.1297 4.1795 1.4828 2.1343 2.3298 3.2562 10.5701 3.1909 3.1341 7.3078 7.6356 12.6296 1.0885 1.0932 1.0990
irintensity: 0.4503 0.1907 0.8619 0.1552 1.7798 0.5849 6.2184 0.1313 0.1977 0.2405 0.3517 3.0946 3.6902 1.9529 7.3257 1.2283 0.4078 0.2017 12.3376 21.9504 2.7602 75.7610 91.5920 4.5881 28.1482 196.0015 157.1740 23.0013 44.3955 2.9179 21.6914 33.3369 240.3575 5.6333 72.8697 3.3352 7.6398 11.2977 2.6525 2.9363 0.0152 1.5797
temp: 298.150 k
press: 1.00000 atm
elementType: 9 9 9 9 7 6 6 6 6 6 6 6 6 1 1 1
symmnumber: 1
zpe: 241042.3 jmol-1
zpe.correction: 0.091808 hartree
zpe.thermalcorrener: 0.102784 hartree
zpe.thermalcorrenthalpy: 0.103728 hartree
zpe.thermalcorrgfe: 0.054031 hartree
zpe.sumelectzpe: -759.838946 hartree
zpe.sumelectthermal: -759.827971 hartree
zpe.sumelectthermalent: -759.827027 hartree
zpe.sumelectthermalfe: -759.876723 hartree
dipole: -2.8724 -6.1346 -0.0007
dipole: 6.7737
quadrupole: -73.2449 -74.8002 -73.5273
quadrupole: 5.6438 -0.0014 -0.0016
quadrupole: 0.6126 -0.9427 0.3301 5.6438 -0.0014 -0.0016
hfenergy: -759.9307547 hartree
pointgroup: C01 [X(C8H3F4N1)]
dipole: -1.2628143 -2.3468035 -0.0009637 debye
dipolederiv: -0.6014249 0.275336 -0.0000918 0.1945241 -0.5949712 -0.0000944 -0.0002019 0.0000191 -0.2818905 -0.536615 -0.0836299 0.1466134 -0.1458005 -0.3773736 0.2165845 0.1354457 0.1830313 -0.6131601 -0.5363455 -0.0831922 -0.1465878 -0.1453953 -0.3769279 -0.2166117 -0.1356512 -0.1829753 -0.6141651 -0.6227633 0.3368216 -0.0005342 0.454534 -0.5132568 0.0005043 -0.0005388 0.000388 -0.1197438 -0.188601 0.0086407 0.0000321 -0.0161144 -0.1736783 0.0000388 0.0000333 0.0000341 -0.2094893 -0.3270126 -0.0956422 -0.0001095 0.0240251 0.1214499 -0.0000245 0.0000779 -0.0001146 -0.1417823 0.0130998 0.1689291 -0.0001364 -0.1277356 0.0291123 -0.000081 -0.0000709 0.0002069 0.1122468 -0.1057072 -0.2171158 0.0000553 -0.0575757 -0.1418547 -0.0000617 -0.0000313 -0.0001882 -0.1114397 1.9146136 -0.0973798 0.0002521 0.1237835 1.3110436 0.0001339 0.0004479 -0.0000743 1.5354699 0.6921877 -0.406411 0.0006235 -0.584511 0.5650361 -0.0006433 0.0006282 -0.0004718 0.1154115 0.0984424 0.1637679 0.0001425 -0.0009432 0.1108081 -0.0000615 0.0001729 0.000087 -0.1107881 0.0207747 -0.0004302 0.0001295 0.2209093 -0.15529 0.0002013 0.0000861 -0.0000004 -0.1329957 0.0236748 0.0359333 -0.0000785 0.0748052 0.0744546 0.000027 -0.0000981 -0.000036 0.0595263 0.077363 0.0516335 -0.0000908 0.0454412 0.0554505 0.0000707 -0.0000816 0.0000702 0.1677316 0.075644 -0.0393279 -0.0000642 -0.0474934 -0.0367649 0.0000088 -0.0000599 0.0000149 0.1617131 0.0026696 -0.0179332 -0.0001552 -0.0124534 0.1027622 0.0000089 -0.0001583 0.0000088 0.1833555 unknown
polarizability: 99.8732907|9.2358007|125.0449594|0.0501527|-0.0069587|42.9555821 unknown
InChI: InChI=1S/C8H3F4N/c9-7-3-1-2-6(5(7)4-13)8(10,11)12/h1-3H
charge 0 multiplicity 1
16 atoms
F  2.654103 -1.43797 0.001889
F  2.258195 0.483825 -1.131244
F  2.256312 0.482469 1.13671
F  -2.884216 1.158286 -0.002681
N  0.075914 3.039711 -0.00014
C  0.384875 -0.578681 0.000552
C  -0.565752 0.488435 -0.000521
C  -0.044589 -1.920519 0.000554
C  1.863428 -0.267503 0.001895
C  -1.937455 0.133139 -0.001624
C  -1.424692 -2.227452 -0.000562
C  -2.385955 -1.196326 -0.001675
C  -0.200421 1.877833 -0.000414
H  0.697757 -2.721886 0.001392
H  -1.749638 -3.271691 -0.000571
H  -3.459268 -1.403968 -0.00256
