program: Gaussian 09
title: 000145603
version: EM64L-G09RevD.01
frameworkgroup: C1[X(C11H12F9N3)]
method: RPBEPBE
basis: SDD
operation: Freq
keyword: #p
keyword: freq=noraman
keyword: PBEPBE/SDD
title: #p freq=noraman PBEPBE/SDD
converged: YES YES NO NO
title: Mulliken charges:
elementType: F F F F F F F F F N N N C C C C C C C C C C C H H H H H H H H H H H H
charge: -0.142067 -0.118471 -0.140768 -0.142028 -0.120544 -0.133336 -0.132646 -0.147852 -0.132421 -0.102011 -0.060806 -0.100629 0.373777 0.013922 -0.621470 -0.506928 -0.499892 -0.398471 -0.400487 0.363882 0.364906 -0.389791 0.412088 0.292627 0.285587 0.245640 0.213718 0.204558 0.247574 0.223662 0.205903 0.207005 0.231984 0.189372 0.214415
chargesum: 0.00000
title: Mulliken charges with hydrogens summed into heavy atoms:
elementType: F F F F F F F F F N N N C C C C C C C C C C C
charge: -0.142067 -0.118471 -0.140768 -0.142028 -0.120544 -0.133336 -0.132646 -0.147852 -0.132421 -0.102011 -0.060806 -0.100629 0.373777 0.013922 -0.043256 -0.047570 -0.047761 0.031094 0.038502 0.363882 0.364906 0.013996 0.412088
polarizability: 1.58466651e+02 4.48964966e+00 1.41315754e+02 -2.08340380e+00 -3.02144102e-01 1.17351026e+02
1716.lowfreq: -8.1571 -5.7940 -0.0013 -0.0011 -0.0008 3.7048 37.7883 40.4998 53.5536
frequency: 37.7472 40.4201 53.4743 62.1387 67.0122 82.2753 98.4340 108.6519 148.2789 169.1644 175.3657 198.7560 221.0229 234.7933 237.0731 266.1784 273.8300 287.6340 302.6709 315.4223 342.4329 367.3917 383.3233 394.9360 423.9897 439.4997 461.3770 465.5493 480.6059 487.1389 497.9986 524.0453 531.5398 577.9378 597.2123 599.5455 620.0567 651.4683 700.6473 743.6225 766.3838 776.8355 782.2006 798.3438 812.3088 828.1876 845.1544 892.2523 895.8956 926.4665 933.8331 959.9610 963.8133 988.8653 1012.2992 1029.6099 1034.9309 1051.3409 1053.0546 1068.6612 1076.7541 1080.4575 1087.9691 1102.3399 1104.3799 1105.5347 1133.0616 1149.3866 1152.6969 1186.8075 1234.5484 1249.8313 1264.6122 1275.8128 1290.4056 1320.0018 1325.5235 1340.7338 1346.5313 1348.1589 1361.5386 1453.1650 1458.9436 1464.9209 1469.3258 1471.5598 1478.2705 2966.0015 2978.9786 2984.6265 2990.7992 2995.2589 3040.1619 3045.0145 3051.7811 3053.1382 3058.7916 3073.0368 3115.2799
redmass: 17.5928 9.7525 10.3862 16.0267 5.9079 10.0558 4.7839 3.9152 12.6678 8.0017 6.4468 4.5839 10.4665 4.0230 4.7584 5.6452 6.7944 7.5161 6.5617 3.5593 2.4088 10.9842 3.2891 10.2911 3.0818 4.0179 4.8646 15.9253 12.9956 5.6846 6.6816 4.8009 7.6111 5.4515 4.6822 6.3510 12.0020 14.4045 8.3776 9.7845 4.8873 1.8740 4.1714 6.2609 4.2001 2.5011 2.0960 2.9930 3.6865 1.4286 3.4482 2.4132 2.6048 8.7952 10.5488 10.3180 7.2070 2.4371 8.2032 9.8400 2.7877 3.3019 6.1082 1.7336 5.9833 2.7938 1.8558 2.4290 1.8394 8.0031 2.7647 1.4665 1.3380 1.2623 1.5375 1.4187 1.3421 1.3709 1.4161 1.4823 1.4349 1.0836 1.0900 1.0849 1.0816 1.0799 1.0883 1.0651 1.0638 1.0653 1.0618 1.0612 1.0954 1.0980 1.0719 1.0912 1.1017 1.0965 1.1046
irintensity: 0.1361 0.0445 0.0455 0.0756 0.4301 0.1247 0.2554 0.1231 2.9191 0.1047 0.3460 0.8669 2.6800 1.7156 0.3902 0.2561 0.6138 0.0167 0.4066 1.0172 0.3548 3.2695 2.2410 2.4646 0.9820 4.5351 1.6229 3.2130 0.4899 0.6436 0.1385 3.4377 2.7038 3.6217 6.7963 13.3022 18.2726 15.7351 3.7345 1.7972 8.1089 3.7490 10.1152 9.7386 11.9428 9.4581 5.3801 15.0566 14.9530 16.5736 37.1081 21.9730 72.0010 11.4358 89.9430 5.8273 136.7085 20.5237 297.4335 269.5537 37.5860 30.9054 436.4458 20.3620 62.7846 116.4447 79.7282 15.0767 14.7299 269.4229 26.4794 5.1257 7.4051 7.7791 15.3919 2.7220 9.5324 0.3136 0.9442 0.9719 1.8659 7.9527 6.5641 10.3448 8.1234 29.1297 7.0307 37.6289 5.4277 32.4963 17.9839 27.3165 57.3279 28.5249 3.3199 3.6370 62.1869 17.4630 0.2433
temp: 298.150 k
press: 1.00000 atm
elementType: 9 9 9 9 9 9 9 9 9 7 7 7 6 6 6 6 6 6 6 6 6 6 6 1 1 1 1 1 1 1 1 1 1 1 1
symmnumber: 1
zpe: 614744.2 jmol-1
zpe.correction: 0.234144 hartree
zpe.thermalcorrener: 0.255456 hartree
zpe.thermalcorrenthalpy: 0.256400 hartree
zpe.thermalcorrgfe: 0.183979 hartree
zpe.sumelectzpe: -1487.313839 hartree
zpe.sumelectthermal: -1487.292526 hartree
zpe.sumelectthermalent: -1487.291582 hartree
zpe.sumelectthermalfe: -1487.364004 hartree
dipole: -3.6212 -3.8023 2.5358
dipole: 5.8310
quadrupole: -133.7861 -134.7871 -133.4644
quadrupole: 5.3696 -2.1759 -1.9941
quadrupole: 0.2264 -0.7746 0.5481 5.3696 -2.1759 -1.9941
hfenergy: -1487.5479822 hartree
pointgroup: C01 [X(C11H12F9N3)]
dipole: 1.5565034 1.3637593 0.9901538 debye
polarizability: 159.136547|3.0098929|140.6918504|1.5527901|0.32652|117.3050335 unknown
InChI: InChI=1S/C11H12F9N3/c12-9(13,14)8(10(15,16)17)6-7(4-2-1-3-5-7)21-22(8)23(21)11(18,19)20/h1-6H2
charge 0 multiplicity 1
35 atoms
F  -0.995597 2.083348 -1.73622
F  -3.014689 1.117039 -1.423928
F  -2.315123 2.766765 -0.036153
F  -3.30676 0.659244 1.446697
F  -2.931369 -1.189293 0.181907
F  -1.785145 -0.868887 2.098898
F  0.677086 -2.59371 -1.970103
F  1.703331 -3.174884 -0.033154
F  -0.534868 -3.506251 -0.289454
N  1.017209 -0.202744 -0.582504
N  -0.493658 -0.380712 -0.801906
N  0.272317 -1.355532 0.109934
C  1.26201 0.88624 0.471554
C  -1.212256 0.576647 0.178207
C  -0.134029 1.207312 1.104316
C  2.260758 0.350435 1.529951
C  1.87506 2.086095 -0.302596
C  3.657529 0.040829 0.942544
C  3.271313 1.767818 -0.886389
C  -1.898074 1.6258 -0.751285
C  -2.301653 -0.214877 0.968103
C  4.243413 1.267592 0.205473
C  0.522183 -2.634811 -0.577973
H  -0.20297 0.756561 2.105911
H  -0.281648 2.293992 1.206201
H  1.830183 -0.544698 2.015526
H  2.359992 1.133976 2.3082
H  1.960292 2.923514 0.419769
H  1.189732 2.41443 -1.102773
H  3.583436 -0.81072 0.23845
H  4.330277 -0.277621 1.760891
H  3.673391 2.67562 -1.374163
H  3.170448 0.995064 -1.671869
H  4.431897 2.081794 0.936388
H  5.22008 1.008622 -0.24445
