program: Gaussian 09
title: 000145600
version: EM64L-G09RevD.01
frameworkgroup: C1[X(C7H3ClF2O)]
method: RPBEPBE
basis: SDD
operation: Freq
keyword: #p
keyword: freq=noraman
keyword: PBEPBE/SDD
title: #p freq=noraman PBEPBE/SDD
converged: NO NO NO NO
title: Mulliken charges:
elementType: Cl F F O C C C C C C C H H H
charge: -0.072920 -0.189336 -0.189246 -0.097940 0.477288 -0.453187 -0.517835 0.408938 0.401136 -0.504884 -0.160424 0.296876 0.304446 0.297087
chargesum: 0.00000
title: Mulliken charges with hydrogens summed into heavy atoms:
elementType: Cl F F O C C C C C C C
charge: -0.072920 -0.189336 -0.189246 -0.097940 0.477288 -0.156311 -0.213389 0.408938 0.401136 -0.207796 -0.160424
polarizability: 1.25456220e+02 -2.89342325e+00 1.03181417e+02 -1.95386289e-03 -1.66951866e-02 3.33498037e+01
1716.lowfreq: 0.0016 0.0029 0.0031 1.2685 10.1430 10.3146 35.1991 138.3113 145.2356
frequency: 34.0435 138.3071 145.2184 223.6900 244.3376 250.3593 311.3112 374.9678 432.3817 474.3122 492.8619 506.6041 543.3688 576.6591 644.3280 693.9415 724.0122 867.7572 893.0803 904.6649 952.5363 979.6262 986.7995 1100.3743 1127.3454 1238.9212 1277.3516 1401.3047 1432.2641 1452.3841 1592.8242 1616.1334 1715.9268 3190.9385 3200.9701 3202.9423
redmass: 17.1929 8.4096 15.1126 6.2609 4.6612 19.0873 14.6046 13.0035 10.4034 6.2205 7.0892 9.2309 7.1387 5.0485 3.1846 3.1732 10.4224 1.5207 1.4212 1.5942 5.8733 5.4820 5.9490 1.4765 1.5823 1.2371 10.8834 9.8720 4.1797 3.5689 6.9857 8.0942 13.0460 1.0934 1.0931 1.0946
irintensity: 0.0453 2.7347 3.1448 0.8914 0.0002 3.7624 6.6335 1.6928 19.2599 2.6288 5.9734 3.2149 5.6007 0.0006 4.2378 28.8207 214.2081 24.9126 4.1747 55.6952 104.1324 18.0108 0.5356 32.0183 72.3427 3.4602 227.1830 1.5166 102.0011 4.7739 138.1240 11.9184 248.6277 5.7677 10.3592 1.6888
temp: 298.150 k
press: 1.00000 atm
elementType: 17 9 9 8 6 6 6 6 6 6 6 1 1 1
symmnumber: 1
zpe: 214997.9 jmol-1
zpe.correction: 0.081888 hartree
zpe.thermalcorrener: 0.091240 hartree
zpe.thermalcorrenthalpy: 0.092184 hartree
zpe.thermalcorrgfe: 0.045858 hartree
zpe.sumelectzpe: -1002.739391 hartree
zpe.sumelectthermal: -1002.730040 hartree
zpe.sumelectthermalent: -1002.729096 hartree
zpe.sumelectthermalfe: -1002.775422 hartree
dipole: 2.1559 0.6821 0.0064
dipole: 2.2612
quadrupole: -75.3490 -74.1393 -68.1067
quadrupole: -1.7791 -0.0125 -0.0081
quadrupole: -2.8173 -1.6077 4.4250 -1.7791 -0.0125 -0.0081
hfenergy: -1002.8212798 hartree
pointgroup: C01 [X(C7H3Cl1F2O1)]
dipole: 0.8796254 -0.1330013 -0.0027926 debye
dipolederiv: -0.5810169 -0.3515039 0.0008094 -0.5127992 -0.7156814 0.0012733 0.0023063 0.002391 -0.124539 -0.5514281 -0.4156981 -0.0001678 -0.4734279 -0.747847 -0.0002391 -0.0002495 -0.0004745 -0.1478957 -0.3946212 0.3253878 -0.0000424 0.4098222 -0.8630218 0.0000723 -0.0000548 0.0002879 -0.1482495 -0.7171282 0.2644803 -0.0005413 0.1346959 -1.0203274 0.0017026 0.0006874 -0.0024344 -0.224179 -0.6972528 0.0379776 0.0003181 -0.0856786 0.0979155 0.0003232 -0.0004731 0.0001309 0.0277534 -0.122835 0.2639796 0.0001669 -0.1306297 -0.2221345 -0.0000297 -0.0006216 0.0001646 -0.1306171 -0.1721177 -0.3178399 0.0000707 0.1686026 -0.1363596 -0.0001046 -0.0007287 -0.0002476 -0.1292489 0.6478116 0.5935473 0.0003529 0.5672748 0.8813986 0.0003276 0.0005047 0.0007066 0.122908 0.4526059 -0.4931942 0.000122 -0.5173271 1.0566887 -0.0001014 0.0003881 -0.0005392 0.1248128 -0.0732102 -0.027377 0.0000964 -0.0251305 -0.3095734 -0.0000399 -0.0000312 -0.0000308 -0.1402708 1.8858442 0.105516 -0.0009242 0.4699293 1.6848914 -0.0031616 -0.0013559 -0.0000342 0.1887693 0.1344786 -0.0476366 -0.0000761 -0.0165274 0.0912242 -0.0000205 -0.0001563 0.000108 0.1870594 0.1270286 0.0564424 -0.0000874 0.0067421 0.0795936 -0.0000101 -0.0000621 -0.0000331 0.1903175 0.0618414 0.0059187 -0.0000971 0.0044536 0.1232332 0.0000077 -0.0001534 0.0000049 0.2033796 unknown
polarizability: 124.0260595|6.1792261|104.6115636|-0.0253709|-0.0295474|33.3498177 unknown
InChI: InChI=1S/C7H3ClF2O/c8-7(11)4-1-5(9)3-6(10)2-4/h1-3H
charge 0 multiplicity 1
14 atoms
Cl -3.233698 -1.275345 0.003491
F  2.290783 2.249246 0.000921
F  1.855919 -2.547028 0.000295
O  -2.780913 1.404712 0.001481
C  -0.725488 0.098027 -0.001395
C  -0.138947 -1.192043 -0.001029
C  0.086459 1.268394 -0.000685
C  1.476823 1.10408 0.000166
C  1.260858 -1.274325 -0.000094
C  2.107993 -0.153033 0.000511
C  -2.199745 0.322964 -0.002466
H  -0.7535 -2.093882 -0.001458
H  -0.367206 2.262387 -0.000879
H  3.195462 -0.252453 0.001243
