program: Gaussian 09
title: 000145578
version: EM64L-G09RevD.01
frameworkgroup: C1[X(C8H12O)]
method: RPBEPBE
basis: SDD
operation: Freq
keyword: #pfreq=noraman
keyword: PBEPBE/SDD
title: #p freq=noraman PBEPBE/SDD
converged: YES YES NO NO
title: Mulliken charges:
elementType: O C C C C C C C C H H H H H H H H H H H H
charge: -0.281350 -0.355478 -0.487486 -0.687723 0.288473 -0.012466 0.051265 -0.569963 -0.599231 0.207459 0.228321 0.219859 0.213619 0.211612 0.209841 0.221183 0.226774 0.231349 0.232081 0.220967 0.230893
chargesum: 0.00000
title: Mulliken charges with hydrogens summed into heavy atoms:
elementType: O C C C C C C C C
charge: -0.281350 0.080303 -0.054007 -0.045087 0.288473 -0.012466 0.278039 -0.106534 -0.147372
polarizability: 1.04588960e+02 2.16150071e+00 1.27880435e+02 5.35710562e+00 4.77951774e+00 5.79726619e+01
1716.lowfreq: -8.1494 -5.1729 -0.0006 0.0006 0.0007 4.0017 43.2167 55.6064 76.3219
frequency: 43.0041 55.5873 76.3014 78.1065 123.4652 171.3997 217.2861 226.3174 242.4869 311.8485 399.5698 432.2023 526.8627 606.9569 655.5647 676.7293 729.9633 746.0258 854.7776 870.8009 889.0773 918.1945 942.3527 947.9046 1007.7894 1045.8642 1063.3590 1096.5284 1131.5921 1167.3233 1221.2114 1259.5368 1283.4462 1298.2730 1313.4595 1345.3741 1389.4151 1393.0888 1449.7922 1457.8865 1476.0160 1477.0630 1486.4884 1650.2160 2002.9390 2972.9266 2980.5059 2995.3308 3040.0229 3045.3423 3060.2264 3075.3182 3079.9397 3113.5282 3132.1552 3132.2279 3238.9757
redmass: 1.7196 2.9713 2.6911 2.1846 3.5303 3.5902 2.0636 1.4020 2.8233 3.0842 2.8888 3.7682 4.0582 1.1836 4.6899 1.4818 2.7548 1.2103 1.3579 1.4015 1.8471 1.3166 2.3009 1.1054 1.3992 2.6002 1.8737 2.1165 2.6342 4.0063 1.6064 1.3965 1.1974 1.2029 1.4949 1.5586 1.2115 1.1637 1.0946 1.4039 1.0491 1.0438 1.0837 4.7350 10.3623 1.0360 1.0631 1.0615 1.0972 1.0593 1.0993 1.0989 1.1022 1.0667 1.1126 1.0900 1.1156
irintensity: 2.4221 0.4003 1.6998 1.5077 0.2075 1.1052 2.5268 2.5966 4.8232 0.3449 2.4632 2.2434 3.9418 1.3422 14.7821 7.2788 2.0664 12.3099 0.8212 88.4979 6.7134 67.2856 9.9687 40.4505 0.1371 27.7132 23.2951 11.6927 117.9126 360.6372 12.7930 17.1014 4.9548 10.7988 16.4990 3.3031 9.2747 1.3014 9.3477 17.5024 3.8514 13.7507 15.8639 150.9042 30.7692 37.6565 11.2553 40.6293 0.7646 24.9618 0.8487 47.4692 84.9556 9.0100 13.1146 6.0267 9.5958
temp: 298.150 k
press: 1.00000 atm
elementType: 8 6 6 6 6 6 6 6 6 1 1 1 1 1 1 1 1 1 1 1 1
symmnumber: 1
zpe: 458324.9 jmol-1
zpe.correction: 0.174567 hartree
zpe.thermalcorrener: 0.185889 hartree
zpe.thermalcorrenthalpy: 0.186833 hartree
zpe.thermalcorrgfe: 0.136426 hartree
zpe.sumelectzpe: -386.476981 hartree
zpe.sumelectthermal: -386.465659 hartree
zpe.sumelectthermalent: -386.464715 hartree
zpe.sumelectthermalfe: -386.515121 hartree
dipole: -0.0361 1.1266 0.3034
dipole: 1.1673
quadrupole: -50.9797 -52.0340 -56.7607
quadrupole: 1.9341 1.5169 0.6111
quadrupole: 2.2784 1.2241 -3.5026 1.9341 1.5169 0.6111
hfenergy: -386.6515477 hartree
pointgroup: C01 [X(C8H12O1)]
dipole: -0.0716396 0.4523792 0.0333974 debye
dipolederiv: -1.4855779 1.1447777 -0.3631509 0.1832191 -0.8417309 0.0844537 -0.3240341 0.3138755 -0.2549536 0.026871 -0.0574472 -0.0260223 -0.0051142 0.1306263 0.0141783 -0.1501764 -0.0521876 0.0955227 -0.0205829 0.0521874 -0.0050621 -0.1030546 -0.0121243 0.0424444 0.0430528 0.0962633 0.0958147 -0.0466302 -0.0596112 -0.0039782 -0.078664 0.0602694 0.0070599 0.0698521 0.0530188 0.0582413 0.7812105 -0.5246092 0.1841894 -0.5105785 1.3627915 -0.2038027 0.2337098 -0.1862395 0.0844396 -0.2718268 0.0288921 0.0228332 0.3131264 -0.2102 0.0528455 -0.0241963 0.0047158 -0.2738361 1.206261 -0.8719197 0.3361244 0.0049155 0.1643369 0.0137673 0.3100054 -0.2176813 0.0583536 -0.2989257 0.0670514 -0.1266242 0.0327776 -0.1162234 0.0488999 -0.1322763 0.038372 0.2124699 -0.3323157 0.3560432 0.0415076 0.3242751 -0.2591322 0.0773186 0.0424991 0.0882937 -0.4893515 0.0457661 -0.0239156 0.0064767 -0.0130525 -0.034365 -0.1395409 0.0179703 -0.0969184 -0.0859832 0.0066802 0.0891749 -0.0493306 0.0844728 -0.0534642 0.0801313 -0.041803 0.0543534 0.0429396 0.0048805 0.0805913 -0.0344479 0.083328 -0.0615508 0.0852144 -0.0081124 0.0526087 0.0584612 0.0272449 -0.0666055 0.0001523 -0.0446628 -0.0360899 -0.1292249 0.010325 -0.0986977 -0.054442 0.067157 0.0244096 0.0204772 -0.0147733 -0.0310081 -0.1323039 -0.0373168 -0.1514637 -0.0583722 -0.0173763 0.0733187 -0.0487344 0.1431165 -0.0743644 0.0725548 -0.0839588 0.0548348 0.0609644 -0.043383 -0.0873959 0.0902979 -0.0911446 0.0396497 0.0838873 0.1242905 0.0945806 -0.0690907 0.0164627 0.0031755 -0.0405357 -0.115116 -0.0168961 -0.0268163 -0.0401869 0.0024245 0.1704528 0.1800657 -0.0436825 0.0147791 -0.0450317 -0.043959 -0.067909 0.0240402 -0.1225642 -0.0278571 0.1404801 -0.0943001 0.0883998 -0.0656637 -0.016478 0.0526641 0.0757193 0.0872642 -0.0208714 -0.0601282 -0.0115153 -0.0680444 -0.0220566 0.0712384 -0.0038143 -0.0701009 0.0002702 0.1820728 0.0736672 -0.0786196 -0.0393069 -0.0603186 -0.0213259 -0.0120076 -0.0393026 -0.0151229 0.2150253 unknown
polarizability: 104.1255178|0.2500428|127.588957|6.0305942|-7.8313196|58.7275818 unknown
InChI: InChI=1S/C8H12O/c1-4-7-8(5-2)9-6-3/h6H,2-4,7H2,1H3
charge 0 multiplicity 1
21 atoms
O  0.758893 -0.831302 -0.209594
C  -2.179661 -0.692872 0.442636
C  -1.456046 -0.046936 -0.769804
C  -3.608422 -1.149695 0.079941
C  -0.023449 0.340105 -0.473696
C  0.456805 1.584812 -0.454192
C  2.116108 -0.693994 0.138346
C  0.895878 2.84106 -0.445212
C  2.881421 -1.786806 0.35978
H  -2.214589 0.037878 1.274031
H  -1.583207 -1.553426 0.797264
H  -2.005907 0.851681 -1.102163
H  -1.4562 -0.767071 -1.613246
H  -3.589655 -1.911066 -0.722587
H  -4.222835 -0.30088 -0.275763
H  -4.119304 -1.593496 0.95368
H  2.486395 0.33671 0.21444
H  0.87458 3.457932 0.465427
H  1.293465 3.325411 -1.349223
H  3.931958 -1.665269 0.634189
H  2.477472 -2.799577 0.271845
