program: Gaussian 09
title: 000145564
version: EM64L-G09RevD.01
frameworkgroup: C1[X(C14H21NO)]
method: RPBEPBE
basis: SDD
operation: Freq
keyword: #p
keyword: freq=noraman
keyword: PBEPBE/SDD
title: #p freq=noraman PBEPBE/SDD
converged: YES YES NO NO
title: Mulliken charges:
elementType: O N C C C C C C C C C C C C C C H H H H H H H H H H H H H H H H H H H H H
charge: -0.336163 0.014222 0.253126 -0.702974 -0.679269 -0.682650 -0.235551 0.562272 -0.262801 0.416908 -0.475751 -0.402521 -0.398340 -0.419957 -0.691925 -0.692148 0.241309 0.191506 0.238360 0.214437 0.238917 0.217685 0.238939 0.219154 0.211925 0.206133 0.235762 0.230954 0.227777 0.214322 0.303930 0.213461 0.210810 0.226902 0.226867 0.210806 0.213566
chargesum: 0.00000
title: Mulliken charges with hydrogens summed into heavy atoms:
elementType: O N C C C C C C C C C C C C C C
charge: -0.336163 0.014222 0.253126 -0.031799 -0.008230 -0.012631 -0.029419 0.562272 -0.027039 0.416908 -0.244797 -0.174744 -0.184018 -0.116026 -0.040752 -0.040909
polarizability: 2.80546618e+02 9.03848520e+00 1.56713577e+02 7.73310300e-02 4.16025091e-02 1.08999024e+02
1716.lowfreq: -19.0278 -4.8347 -0.0008 -0.0004 -0.0002 3.6720 4.7500 32.5649 44.1010
frequency: -17.2560 32.5188 44.0988 77.7352 92.0166 120.6865 161.2657 170.3375 199.2942 216.1305 220.8529 235.3553 242.7556 246.9406 273.2185 312.0601 320.4233 346.3805 374.6565 381.2855 412.0655 438.0474 439.4925 472.7539 523.9822 551.6174 558.0284 634.8843 637.9160 708.0549 747.4691 787.4622 788.6905 825.6300 844.6460 865.0900 878.5093 889.5276 915.9086 920.8953 927.9781 953.7058 955.1913 959.6772 993.4603 1007.0439 1025.7796 1028.1567 1050.7243 1076.2029 1111.9599 1115.6720 1153.7573 1181.1691 1190.8011 1220.2809 1228.6308 1236.8989 1260.7023 1290.5936 1306.0959 1331.9434 1376.6025 1378.9371 1380.6789 1383.6636 1395.3313 1407.1785 1413.3692 1415.7494 1447.1361 1459.6431 1461.6069 1465.3139 1468.0628 1473.2384 1478.1847 1479.1116 1481.7312 1490.6009 1495.0864 1548.4344 1563.0630 1615.4993 2974.8559 2976.3041 2978.1560 2985.1414 2987.6838 3004.7229 3068.3374 3074.7611 3077.4906 3079.5749 3082.2549 3084.5268 3090.7542 3093.7888 3103.4860 3104.4292 3121.2750 3121.7395 3131.5988 3152.2619 3187.3179
redmass: 2.8911 3.2976 3.2690 4.8000 3.9765 3.4831 1.0883 3.2072 1.4776 1.4218 1.7769 1.0612 1.2740 1.5350 2.7228 2.9835 2.5461 3.0658 2.5463 4.8531 2.8904 3.2989 3.1444 3.0659 3.1516 2.4662 3.1422 7.0146 4.8091 3.5978 2.6532 1.4647 3.4853 4.2681 1.4046 1.4852 5.4004 2.6756 1.1777 1.6089 1.5506 1.4338 1.2035 1.4092 1.3501 2.9834 1.4194 1.4140 1.5153 3.7721 2.5774 1.5710 1.7404 1.9443 1.1744 1.9088 2.6130 3.0823 2.6912 1.6170 1.3222 1.7161 1.1930 1.9223 1.1940 1.6913 1.2153 1.6592 1.4010 2.7303 1.0478 1.0576 1.0487 1.0447 1.0513 1.0569 1.1024 1.0693 1.2286 1.1333 1.5820 6.4606 5.5906 6.2317 1.0347 1.0684 1.0499 1.0353 1.0357 1.0373 1.1000 1.0993 1.1004 1.0998 1.0995 1.0991 1.1009 1.1004 1.0984 1.0868 1.0999 1.0899 1.0961 1.0889 1.0938
irintensity: 0.4015 2.0396 0.1563 1.9118 1.6093 1.9867 0.1044 0.5099 0.1053 0.0644 0.0097 0.1378 0.1332 0.3742 0.8888 0.9150 0.2697 0.8288 0.2311 14.8777 0.0002 1.8627 2.8430 0.7783 2.5566 27.6659 0.2788 0.4467 6.8729 0.1222 0.2651 1.4935 0.3712 1.8548 31.7653 47.7849 12.0122 2.3507 3.1350 1.9327 3.3698 0.0188 0.4363 0.3293 2.3717 6.0976 0.5478 2.6012 37.2729 79.8482 1.2302 28.4050 1.1876 93.0673 2.8439 4.6411 14.9277 18.7444 9.1555 17.6880 0.8911 0.6588 15.5221 32.8634 23.3880 28.7187 7.7627 11.8005 5.6008 16.6926 0.9176 0.6249 0.4655 1.4566 4.3738 7.6803 3.7552 25.0187 8.1165 43.6066 2.9913 25.8408 12.9484 9.3957 32.6374 28.6961 41.3663 19.7945 21.5020 29.2332 0.1463 116.5958 24.6481 2.0647 40.2369 65.2210 11.1497 19.7387 52.9696 14.2821 22.1618 27.2410 24.9207 15.8066 4.8843
temp: 298.150 k
press: 1.00000 atm
elementType: 8 7 6 6 6 6 6 6 6 6 6 6 6 6 6 6 1 1 1 1 1 1 1 1 1 1 1 1 1 1 1 1 1 1 1 1 1
symmnumber: 1
zpe: 831846.0 jmol-1
zpe.correction: 0.316833 hartree
zpe.thermalcorrener: 0.333685 hartree
zpe.thermalcorrenthalpy: 0.334629 hartree
zpe.thermalcorrgfe: 0.272868 hartree
zpe.sumelectzpe: -674.794106 hartree
zpe.sumelectthermal: -674.777255 hartree
zpe.sumelectthermalent: -674.776310 hartree
zpe.sumelectthermalfe: -674.838072 hartree
dipole: -1.0463 2.9633 0.0179
dipole: 3.1426
quadrupole: -78.2422 -97.2274 -100.9462
quadrupole: -6.2118 -0.0461 -0.0490
quadrupole: 13.8964 -5.0888 -8.8076 -6.2118 -0.0461 -0.0490
hfenergy: -675.1109394 hartree
pointgroup: C01 [X(C14H21N1O1)]
dipole: -0.4039627 1.1683922 -0.019405 debye
polarizability: 280.6445253|8.1877215|156.567037|-1.7942768|-1.2741013|109.0476573 unknown
InChI: InChI=1S/C14H21NO/c1-11(2)13-8-6-12(7-9-13)10-15(16)14(3,4)5/h6-11H,1-5H3
charge 0 multiplicity 1
37 atoms
O  -2.100602 -1.714207 0.092234
N  -2.372338 -0.410894 0.06497
C  -3.884856 -0.003094 0.075092
C  -4.716266 -1.299202 0.068745
C  -4.161672 0.806621 1.365719
C  -4.180287 0.829511 -1.196498
C  4.411001 0.128941 -0.008351
C  2.883073 0.210182 0.004111
C  -1.435102 0.55316 0.034429
C  0.006256 0.37151 0.026001
C  2.220807 1.465888 -0.022599
C  2.077686 -0.959253 0.042121
C  0.817042 1.548725 -0.012235
C  0.671446 -0.896152 0.053198
C  4.933341 -0.60254 -1.274486
C  4.958179 -0.541811 1.280518
H  -4.488393 -1.922861 0.947398
H  -5.78828 -1.03132 0.082154
H  -4.506613 -1.903199 -0.82842
H  -3.607347 1.761147 1.389511
H  -3.882214 0.220498 2.258696
H  -5.240012 1.040297 1.428261
H  -3.894674 0.26864 -2.103622
H  -5.262996 1.044319 -1.249109
H  -3.645926 1.795535 -1.202468
H  4.800296 1.167081 -0.036959
H  -1.818431 1.576684 0.011997
H  2.817246 2.386402 -0.052013
H  2.558545 -1.945124 0.062975
H  0.33249 2.533666 -0.033959
H  0.062343 -1.801541 0.082872
H  4.586461 -1.652211 -1.297522
H  6.039239 -0.611303 -1.289692
H  4.576396 -0.10933 -2.1964
H  4.623378 -0.00207 2.184518
H  6.064092 -0.555121 1.272167
H  4.607992 -1.587372 1.363146
