program: Gaussian 09
title: 000145541
version: EM64L-G09RevD.01
frameworkgroup: C1[X(C20H22N2O3)]
method: RPBEPBE
basis: SDD
operation: Freq
keyword: #p
keyword: freq=noraman
keyword: PBEPBE/SDD
title: #p freq=noraman PBEPBE/SDD
converged: YES YES NO NO
title: Mulliken charges:
elementType: O O O N N C C C C C C C C C C C C C C C C C C C C H H H H H H H H H H H H H H H H H H H H H H
charge: -0.215077 -0.284953 -0.215520 -0.116091 -0.101912 -0.355658 -0.517137 -0.344441 0.109455 0.300344 -0.694366 -0.334448 -0.330348 -0.305216 -0.374375 0.171815 0.160223 0.359403 -0.263488 -0.334280 -0.375913 -0.300081 -0.484105 0.250486 -0.655352 0.212455 0.212196 0.232038 0.231742 0.189363 0.189129 0.212493 0.212685 0.214992 0.279268 0.250021 0.278621 0.252039 0.280517 0.256310 0.259140 0.306985 0.249770 0.249808 0.230838 0.219442 0.231183
chargesum: 0.00000
title: Mulliken charges with hydrogens summed into heavy atoms:
elementType: O O O N N C C C C C C C C C C C C C C C C C C C C
charge: -0.215077 -0.284953 -0.215520 -0.116091 -0.101912 0.068993 -0.053357 0.034051 0.109455 0.300344 -0.054195 -0.055180 -0.080328 -0.026595 -0.122336 0.171815 0.160223 0.359403 0.017030 -0.077970 -0.116773 0.006905 0.015473 0.250486 0.026111
polarizability: 6.40309025e+02 7.83399938e+00 2.20748278e+02 -1.73225789e+00 1.44011498e+00 1.20683450e+02
1716.lowfreq: -9.7929 -3.0805 -0.0013 -0.0009 0.0014 1.9944 12.1452 20.9276 25.5346
frequency: 10.6431 20.1103 25.5155 27.5981 35.1523 41.6067 46.5590 56.3373 67.1461 75.6127 96.2821 109.5585 126.6872 130.2789 163.1811 172.3044 176.4986 215.7299 226.6461 233.3296 267.3851 292.7104 311.4867 313.1147 338.1157 347.3701 384.7027 406.4016 422.9331 428.0745 485.4727 487.8180 523.8367 527.0915 541.3359 557.5729 579.2736 612.1888 628.1321 645.0633 669.3588 720.2754 732.9759 740.3651 750.4402 768.7479 790.7432 797.3309 822.3673 842.4871 846.1508 848.7780 868.9932 880.4370 898.8377 901.5819 924.5406 972.8678 980.1773 986.8665 993.2588 997.2213 1001.7067 1008.2164 1017.4948 1042.9143 1060.9282 1083.2739 1085.1280 1090.9564 1097.3460 1104.8071 1109.6853 1112.9211 1137.8215 1152.8059 1171.1616 1192.4151 1203.5506 1206.2915 1237.8168 1242.5666 1269.0700 1274.3193 1284.1306 1291.3600 1297.6136 1330.9556 1334.8905 1346.0680 1356.2555 1374.7511 1386.4793 1390.6140 1400.2334 1420.6918 1427.1385 1433.1054 1439.9995 1464.1641 1470.7750 1471.2732 1473.7077 1476.5126 1479.8710 1480.4845 1486.6931 1558.0924 1566.4443 1585.1645 1607.6739 1613.3471 1663.6696 2955.1804 2959.7281 2974.5389 2995.2515 2998.6466 2999.6626 3002.1836 3004.7861 3044.8992 3055.4872 3072.5027 3073.3879 3100.5328 3104.5231 3146.5645 3150.0700 3157.2258 3160.7549 3167.4109 3173.1721 3177.4446 3214.7481
redmass: 4.8033 4.1057 3.1833 4.7340 2.9058 2.5960 2.1689 4.3377 4.4640 3.6398 5.1931 4.5670 2.1467 6.0968 4.0594 4.2512 1.4129 5.5979 1.1496 4.3352 4.9632 4.1734 6.3151 5.8000 4.8476 5.6226 5.1259 2.9279 3.3605 4.5921 4.6980 3.1002 5.5999 2.7149 2.6522 6.9734 2.1890 6.7685 7.1831 5.9274 5.6066 1.2505 2.9471 6.5600 2.7200 5.9753 1.3415 1.4190 6.2457 1.2717 1.3131 5.0194 1.5113 1.4735 4.3490 2.1071 1.3839 5.6236 1.3786 1.3340 1.3418 2.8185 2.5795 2.0084 1.3429 2.7157 3.1364 2.0651 1.6045 1.5024 2.4850 1.4778 1.5305 1.9250 2.0413 1.5780 2.0105 1.7715 1.4836 2.0596 3.2625 1.1719 1.6965 1.2114 1.0575 1.3249 1.3300 1.7290 1.7537 5.9351 1.7913 5.4189 6.9341 1.2283 1.2102 4.3839 3.9799 1.1045 1.0899 1.0726 2.3526 1.0392 1.0744 1.0450 1.2662 1.7997 1.0779 7.0931 7.3824 7.6786 6.7887 6.8375 9.8559 1.0599 1.0590 1.0361 1.0604 1.0577 1.0965 1.0394 1.1007 1.0986 1.1029 1.1009 1.0994 1.1004 1.1005 1.0875 1.0885 1.0883 1.0911 1.0963 1.0961 1.0969 1.0948
irintensity: 0.0025 0.1890 0.0681 0.1312 0.0209 2.0283 0.4800 0.8109 0.4938 3.0153 0.0381 0.5794 1.5478 0.1031 0.4806 5.9906 0.3829 3.4756 0.0529 0.5435 0.4287 6.0952 2.4085 27.7146 1.8591 3.2495 0.8075 0.0896 0.0408 1.5507 5.2037 0.0249 34.1191 4.0596 9.2075 0.5582 24.4215 4.5617 0.3436 0.3230 13.9014 16.7649 5.0222 21.6694 3.3958 6.5313 15.9537 3.1762 1.0907 0.1166 10.3792 36.8954 41.3291 93.1575 10.9363 14.1199 0.2376 121.8855 1.6183 0.0048 0.5603 1.7480 0.5062 170.3268 0.0191 8.5910 772.7700 2.4101 0.2618 0.6475 515.5544 103.2830 41.4081 16.7919 89.0778 100.0082 128.5610 36.9804 1.2829 229.2100 125.7790 0.0391 128.4174 10.7800 0.3989 0.1455 7.4931 57.5304 96.1448 64.6347 19.4453 15.1582 1.1444 15.0441 22.1875 26.2763 18.5964 12.8108 28.2612 2.2162 98.4686 13.3015 9.7544 12.4617 16.5168 1.3694 16.2333 103.5437 40.9136 145.6092 113.9371 10.8563 200.8475 24.8855 46.4029 42.3623 29.8438 35.4752 14.8364 18.7244 2.9694 3.2045 16.9983 93.2044 52.9638 29.0398 29.7952 10.1427 0.7444 3.4546 2.5463 13.2515 1.0660 8.0371 1.6907
temp: 298.150 k
press: 1.00000 atm
elementType: 8 8 8 7 7 6 6 6 6 6 6 6 6 6 6 6 6 6 6 6 6 6 6 6 6 1 1 1 1 1 1 1 1 1 1 1 1 1 1 1 1 1 1 1 1 1 1
symmnumber: 1
zpe: 983304.8 jmol-1
zpe.correction: 0.374521 hartree
zpe.thermalcorrener: 0.399839 hartree
zpe.thermalcorrenthalpy: 0.400783 hartree
zpe.thermalcorrgfe: 0.313672 hartree
zpe.sumelectzpe: -1108.656503 hartree
zpe.sumelectthermal: -1108.631185 hartree
zpe.sumelectthermalent: -1108.630241 hartree
zpe.sumelectthermalfe: -1108.717352 hartree
dipole: -2.8751 -4.4948 -0.0008
dipole: 5.3356
quadrupole: -121.4304 -146.3126 -149.5288
quadrupole: -3.6269 0.7848 0.2366
quadrupole: 17.6602 -7.2220 -10.4382 -3.6269 0.7848 0.2366
hfenergy: -1109.0310241 hartree
pointgroup: C01 [X(C20H22N2O3)]
dipole: 1.0873787 -0.0173529 1.7955402 debye
polarizability: 639.5333972|8.3753488|120.7970815|18.2305446|-0.462529|221.4102743 unknown
InChI: InChI=1S/C20H22N2O3/c1-3-5-6-19(23)15-7-9-16(10-8-15)21-22-17-11-13-18(14-12-17)25-20(24)4-2/h7-14H,3-6H2,1-2H3
charge 0 multiplicity 1
47 atoms
O  -5.921094 -0.221296 -2.153464
O  6.373535 -0.088993 0.90319
O  7.492588 -0.114508 -1.176073
N  0.033556 -0.171455 0.447974
N  0.901372 -0.158942 -0.534753
C  -8.067606 -0.390291 -0.32831
C  -6.615716 -0.343424 0.182261
C  -9.09289 -0.50934 0.821257
C  -5.57213 -0.261273 -0.936084
C  -4.11305 -0.233962 -0.566266
C  -10.549738 -0.560507 0.312648
C  -3.146632 -0.190383 -1.614271
C  -3.665198 -0.252215 0.782698
C  -1.774475 -0.169179 -1.331982
C  -2.289201 -0.22784 1.075246
C  -1.334576 -0.188851 0.024761
C  2.267347 -0.140016 -0.120243
C  5.025527 -0.107101 0.449795
C  2.712535 -0.121128 1.235072
C  3.222066 -0.140844 -1.16998
C  4.084622 -0.104422 1.513561
C  4.605861 -0.125224 -0.903382
C  8.758984 -0.066935 0.952231
C  7.524749 -0.093122 0.068311
C  10.06852 -0.078965 0.14478
H  -8.18205 -1.242152 -1.025765
H  -8.275375 0.516653 -0.927585
H  -6.477211 0.525409 0.86023
H  -6.399652 -1.239631 0.801478
H  -8.876763 -1.421323 1.415433
H  -8.974087 0.349092 1.514632
H  -10.799679 0.350442 -0.262994
H  -10.705697 -1.4296 -0.353707
H  -11.268667 -0.641029 1.148528
H  -3.515502 -0.175307 -2.645336
H  -4.385932 -0.284876 1.605487
H  -1.024399 -0.138339 -2.127496
H  -1.922557 -0.240167 2.106641
H  1.967834 -0.12013 2.03601
H  2.855556 -0.155116 -2.201426
H  4.459434 -0.089141 2.541388
H  5.334359 -0.127366 -1.713593
H  8.691705 0.829321 1.598693
H  8.700419 -0.932198 1.640204
H  10.140969 -0.984118 -0.48184
H  10.935633 -0.056126 0.827445
H  10.129306 0.794118 -0.526902
