program: Gaussian 09
title: 000145526
version: EM64L-G09RevD.01
frameworkgroup: C1[X(C13H13N2O2)]
method: RPBEPBE
basis: SDD
operation: Freq
keyword: #p
keyword: freq=noraman
keyword: PBEPBE/SDD
title: #p freq=noraman PBEPBE/SDD
converged: NO YES NO NO
title: Mulliken charges:
elementType: O O N N C C C C C C C C C C C C C H H H H H H H H H H H H H
charge: -0.182826 -0.182821 -0.047799 0.034131 -0.572734 -0.425597 0.528873 -0.373230 -0.373463 -0.105562 -0.105532 -0.346284 -0.346220 0.378599 -0.174603 -0.174612 -0.131829 0.250001 0.249929 0.275326 0.275248 0.245121 0.245157 0.294713 0.294721 0.301003 0.301009 0.286476 0.286474 0.296331
chargesum: 1.00000
title: Mulliken charges with hydrogens summed into heavy atoms:
elementType: O O N N C C C C C C C C C C C C C
charge: -0.182826 -0.182821 -0.047799 0.034131 -0.072804 0.124978 0.528873 -0.128109 -0.128306 0.189151 0.189188 -0.045281 -0.045211 0.378599 0.111874 0.111862 0.164501
polarizability: 2.60891666e+02 3.06109324e-04 1.58591910e+02 -1.61665431e+01 -2.73291200e-03 7.17985832e+01
1716.lowfreq: -11.3296 -2.8434 0.0008 0.0009 0.0009 11.1201 14.7230 26.4239 37.1517
frequency: 13.6880 26.4077 37.1497 57.1915 65.3047 92.2156 146.0425 208.9918 237.3924 319.2683 334.1647 375.1452 386.9641 394.3127 408.3729 467.5140 505.6258 506.8860 560.7344 627.6625 637.1907 642.4747 668.0139 690.7510 732.3286 758.8328 775.9611 798.1920 799.1177 833.9870 853.5108 863.3692 870.1409 950.9708 987.4715 987.9853 997.5043 1005.2924 1012.4939 1014.4540 1016.8346 1024.6726 1051.0109 1081.9419 1093.0064 1118.7518 1144.7312 1177.3307 1182.2534 1192.8771 1213.0807 1216.4039 1220.3162 1269.3614 1297.3941 1304.0087 1344.4832 1355.6174 1376.4849 1376.9044 1398.1651 1422.6222 1461.6555 1477.0249 1478.8281 1483.2231 1501.1265 1573.0499 1602.4918 1610.4425 1625.5685 3004.3548 3043.7191 3062.7333 3114.1460 3131.7333 3134.6976 3179.2835 3183.8598 3185.8166 3186.3881 3192.2825 3202.2441 3209.3438
redmass: 4.1496 4.9564 6.6772 3.5784 6.0325 5.4716 7.0234 4.9191 4.8843 4.8887 2.4884 7.4916 2.7832 2.6846 2.8787 3.9549 6.9048 3.4094 5.9882 6.8874 5.7546 6.3517 4.4844 1.9392 4.3749 6.1730 1.7837 1.1592 5.4009 2.8081 1.2428 1.2663 2.0105 1.3714 1.3977 1.3726 1.3720 3.0664 1.6471 4.7646 4.6996 1.3683 2.4083 1.5894 3.3028 1.2829 4.5025 1.1573 1.3610 1.1030 2.5374 5.5485 1.2045 1.2510 1.3333 1.2714 1.2476 1.4830 3.9627 3.9335 6.5961 3.8339 1.4054 2.2697 1.4703 1.7729 1.2431 5.8572 7.7109 6.3783 5.0772 1.0593 1.0597 1.1041 1.1084 1.0910 1.0913 1.0907 1.0943 1.0955 1.0907 1.0958 1.0990 1.1037
irintensity: 0.1548 0.6602 0.7347 0.1695 0.0005 2.3861 2.8387 1.5316 0.1750 4.6512 0.4675 0.8593 0.0303 0.0172 0.0137 4.2986 0.5269 31.7844 1.0514 0.0263 4.5664 0.1027 31.4689 57.1648 1.3270 30.2772 43.5280 0.6810 19.9444 29.3850 0.0438 0.0024 36.8469 1.7576 0.0056 4.5265 0.0060 9.6039 0.0028 4.0849 0.2027 0.1737 2.9903 8.7785 9.1901 11.1964 30.3324 6.0343 50.0522 0.5871 27.6416 175.5813 1.4367 0.0931 2.1251 0.1086 5.5723 1.3440 42.0729 45.3253 2.7702 49.7150 4.0337 50.2799 29.4573 1.3286 19.8041 0.3321 2.5920 11.5802 17.5538 19.1054 6.8432 4.6909 2.4084 10.8147 7.6351 0.0431 1.7428 7.5717 0.2365 1.0603 3.8330 1.0742
temp: 298.150 k
press: 1.00000 atm
elementType: 8 8 7 7 6 6 6 6 6 6 6 6 6 6 6 6 6 1 1 1 1 1 1 1 1 1 1 1 1 1
symmnumber: 1
zpe: 623095.0 jmol-1
zpe.correction: 0.237324 hartree
zpe.thermalcorrener: 0.251852 hartree
zpe.thermalcorrenthalpy: 0.252797 hartree
zpe.thermalcorrgfe: 0.192010 hartree
zpe.sumelectzpe: -761.596962 hartree
zpe.sumelectthermal: -761.582434 hartree
zpe.sumelectthermalent: -761.581490 hartree
zpe.sumelectthermalfe: -761.642276 hartree
dipole: -20.2610 -0.0001 0.0144
dipole: 20.2610
quadrupole: -39.4639 -78.0412 -98.4688
quadrupole: -0.0014 3.8409 -0.0120
quadrupole: 32.5274 -6.0499 -26.4775 -0.0014 3.8409 -0.0120
hfenergy: -761.8342862 hartree
pointgroup: C01 [X(C13H13N2O2)]
dipole: -7.9708232 -0.0080739 -0.087374 debye
polarizability: 260.5402615|0.0731424|158.5916861|18.1015681|0.1703737|72.1502114 unknown
InChI: InChI=1S/C13H13N2O2/c16-15(17)13-6-4-12(5-7-13)8-11-14-9-2-1-3-10-14/h1-7,9-10H,8,11H2
charge 1 multiplicity 1
30 atoms
O  5.529072 1.150419 0.429964
O  5.531805 -1.133813 0.424181
N  -3.036021 -0.000022 0.375606
N  4.945402 0.007894 0.311607
C  -0.773538 0.00374 -0.774464
C  -1.541523 0.001626 0.577558
C  0.727702 0.004958 -0.516616
C  1.430394 1.22951 -0.376395
C  1.433289 -1.218619 -0.382405
C  -3.704215 -1.196708 0.253825
C  -3.707121 1.195158 0.255288
C  2.812927 1.24105 -0.106374
C  2.815843 -1.228242 -0.112432
C  3.481877 0.006867 0.025145
C  -5.084732 -1.222061 0.01253
C  -5.087713 1.217423 0.014052
C  -5.79206 -0.003101 -0.109637
H  -1.064424 0.89595 -1.359018
H  -1.06259 -0.887987 -1.360646
H  -1.281287 0.892998 1.172429
H  -1.279164 -0.89029 1.170682
H  0.902838 2.183034 -0.498338
H  0.907944 -2.17275 -0.509013
H  -3.107339 -2.10473 0.363593
H  -3.112464 2.104503 0.366162
H  3.376974 2.171731 -0.002982
H  3.382108 -2.158073 -0.013631
H  -5.59183 -2.185746 -0.07303
H  -5.597149 2.179982 -0.070264
H  -6.869903 -0.004301 -0.293975
