program: Gaussian 09
title: 000145514
version: EM64L-G09RevD.01
frameworkgroup: C1[X(C5H7F4O3P)]
method: RPBEPBE
basis: SDD
operation: Freq
keyword: #p
keyword: freq=noraman
keyword: PBEPBE/SDD
title: #p freq=noraman PBEPBE/SDD
converged: YES YES NO NO
title: Mulliken charges:
elementType: P F F F F O O O C C C C C H H H H H H H
charge: 1.061834 -0.180603 -0.168234 -0.160774 -0.187850 -0.495884 -0.516566 -0.496557 0.350131 -0.355925 -0.269272 -0.339656 0.084300 0.241743 0.247516 0.234843 0.228195 0.243392 0.252730 0.226639
chargesum: 0.00000
title: Mulliken charges with hydrogens summed into heavy atoms:
elementType: P F F F F O O O C C C C C
charge: 1.061834 -0.180603 -0.168234 -0.160774 -0.187850 -0.495884 -0.516566 -0.496557 0.350131 0.133334 0.193765 0.156467 0.310939
polarizability: 1.11271809e+02 -8.38517850e+00 7.98170783e+01 1.20228534e+00 3.91822775e-01 7.15055252e+01
1716.lowfreq: -11.8939 -0.0017 -0.0006 0.0012 2.5255 8.8356 21.2744 30.5072 45.3491
frequency: 20.6610 30.2127 45.3065 54.1150 88.0815 133.1987 165.7382 205.3754 218.6002 240.6197 271.0124 311.1494 323.0848 383.3672 390.7619 478.7666 516.6331 540.8199 567.6975 576.6676 597.0920 667.3139 686.6897 770.6504 827.4360 865.3187 886.8139 943.9159 977.2148 980.1462 987.6631 1035.3859 1070.2280 1093.3886 1136.1330 1154.9868 1159.2687 1191.3750 1262.7532 1297.0736 1314.2215 1324.0754 1336.0711 1369.3401 1436.1190 1459.3104 1467.1631 2993.2493 3021.7166 3030.1880 3070.1144 3080.7367 3102.7397 3124.2116
redmass: 6.4865 8.3449 8.5729 11.1557 4.2389 5.6195 5.3759 3.9163 7.0103 11.3022 12.5347 7.4689 4.9885 5.0783 5.6521 10.1943 9.5349 10.6203 5.4257 9.6342 4.1769 12.2911 6.7940 6.2931 2.1941 4.5065 3.1512 2.8366 6.0337 6.7196 5.8832 6.5005 2.7167 1.5531 4.1516 4.5522 1.1262 1.2299 1.2386 1.1788 1.2274 1.1961 1.3852 1.2858 1.0777 1.0896 1.0920 1.0608 1.0604 1.0616 1.1006 1.0891 1.1048 1.1079
irintensity: 0.7138 1.5663 1.3470 2.3890 9.1762 2.0389 1.6160 1.4865 3.2368 3.7631 4.6833 9.4299 4.5224 2.3325 21.6010 3.3423 9.8655 30.3283 44.2014 106.2296 48.4906 66.8653 81.6096 51.0323 1.0735 106.9676 53.2964 11.4530 133.4710 203.1008 49.2826 65.3087 23.9265 3.2419 37.0925 48.8613 5.2719 6.8175 14.1227 4.7000 9.8442 1.3821 11.6515 4.3215 12.0908 7.7464 1.3169 39.9394 53.6931 25.4171 3.4888 22.3006 13.6944 19.9057
temp: 298.150 k
press: 1.00000 atm
elementType: 15 9 9 9 9 8 8 8 6 6 6 6 6 1 1 1 1 1 1 1
symmnumber: 1
zpe: 336641.0 jmol-1
zpe.correction: 0.128220 hartree
zpe.thermalcorrener: 0.142123 hartree
zpe.thermalcorrenthalpy: 0.143067 hartree
zpe.thermalcorrgfe: 0.084616 hartree
zpe.sumelectzpe: -1159.953858 hartree
zpe.sumelectthermal: -1159.939955 hartree
zpe.sumelectthermalent: -1159.939011 hartree
zpe.sumelectthermalfe: -1159.997462 hartree
dipole: -1.2813 -0.6304 2.5877
dipole: 2.9556
quadrupole: -73.2011 -82.8674 -81.2105
quadrupole: -10.7010 6.1617 2.7151
quadrupole: 5.8919 -3.7744 -2.1175 -10.7010 6.1617 2.7151
hfenergy: -1160.0820775 hartree
pointgroup: C01 [X(C5H7F4O3P1)]
dipole: 0.4697593 1.0496809 -0.1720804 debye
dipolederiv: 1.7851242 -0.081509 0.243911 -0.4226046 0.8779434 -0.0273561 0.2114965 0.0603189 1.0522175 -0.3554588 -0.0243325 -0.0431474 0.0136036 -0.4255832 -0.1788662 0.0510716 -0.2412453 -0.569635 -0.42141 0.0902114 -0.0057046 0.0852499 -0.6262415 0.0661244 0.0213955 0.1316172 -0.3001678 -0.5924822 -0.1154401 0.199882 -0.2440037 -0.3479868 0.2104671 0.2088336 0.1142045 -0.4932626 -0.4137868 -0.0469041 -0.1043316 -0.0622848 -0.2951348 -0.1840072 -0.042093 -0.0789274 -0.7074006 -1.4561624 0.2066065 -0.1939601 0.6991689 -0.5469466 0.1762446 -0.0204053 -0.022681 -0.4433074 -0.9979592 -0.0994565 -0.0776998 -0.2901335 -0.440187 -0.0482712 -0.3319355 -0.1220231 -0.6048902 -0.6965187 -0.043877 -0.1853317 -0.1224345 -0.4812909 -0.2374003 -0.2524284 0.0032652 -0.8061276 0.5910169 -0.0716893 0.0015565 -0.0687514 1.002414 0.1022346 -0.1219931 0.1307334 0.7958446 0.892874 -0.1413615 0.2174806 0.1456462 0.1388306 0.0299795 0.137247 -0.0394017 0.1726329 0.4640783 -0.038252 0.1278716 -0.0948717 0.2400076 0.003222 0.4458918 0.1080689 0.3072187 0.3347654 -0.0058994 0.1170683 0.0931542 0.3262458 0.2679864 0.0339548 0.0513488 0.2011954 0.9893555 0.1432155 -0.1332765 0.1950556 0.6972008 -0.0214681 -0.0176827 -0.0481426 1.1852411 0.0146226 -0.0023748 -0.0019443 -0.109419 0.0381435 -0.1227021 -0.0474963 -0.0533775 -0.0046043 -0.0743513 0.0815232 -0.0422122 0.0937125 -0.0273854 0.0674414 -0.0342818 0.0359798 0.090045 0.0220613 -0.0477792 -0.0360844 -0.0991731 -0.0855293 -0.0357153 -0.0695596 -0.0267342 0.0836821 -0.1340677 0.063688 -0.0291464 0.144875 0.0066181 0.0081128 -0.0722056 -0.013747 0.0159941 0.0553111 0.0116108 -0.1007339 0.0109297 0.0792112 0.0240291 -0.0927024 0.0215268 -0.0573061 -0.0228998 0.0768033 0.0456026 0.0278408 -0.0566256 -0.0970445 0.0117815 -0.0146606 0.059262 0.0158877 0.0452167 0.0002003 0.0044399 -0.073704 -0.0030109 -0.0188887 0.0038768 0.023368 unknown
polarizability: 110.4839052|-0.0062582|71.4197356|9.7568733|0.2968584|80.6907716 unknown
InChI: InChI=1S/C5H7F4O3P/c6-4(7)5(8,9)3-12-13-10-1-2-11-13/h4H,1-3H2
charge 0 multiplicity 1
20 atoms
P  1.919905 -1.047068 -0.856752
F  -1.280245 0.564141 1.164942
F  -1.057421 -1.582877 0.389226
F  -3.684707 -1.05666 0.644035
F  -3.208024 -0.798639 -1.589923
O  0.798218 0.373856 -0.756014
O  3.354863 -0.027026 -1.002095
O  2.23862 -1.365239 0.852163
C  -1.46291 -0.267627 0.011921
C  -0.586128 0.213864 -1.15572
C  4.026833 0.17779 0.317459
C  3.01219 -0.216144 1.413099
C  -2.983703 -0.252285 -0.282865
H  -0.712491 -0.507908 -1.987269
H  -0.931328 1.207775 -1.49116
H  4.312645 1.240359 0.369242
H  4.923882 -0.4664 0.33662
H  3.489948 -0.586264 2.332353
H  2.307504 0.603835 1.638182
H  -3.402351 0.768916 -0.255541
