program: Gaussian 09
title: 000145513
version: EM64L-G09RevD.01
frameworkgroup: C1[X(C7H11NO2S)]
method: RPBEPBE
basis: SDD
operation: Freq
keyword: #p
keyword: freq=noraman
keyword: PBEPBE/SDD
title: #p freq=noraman PBEPBE/SDD
converged: NO NO NO NO
title: Mulliken charges:
elementType: S O O N C C C C C C C H H H H H H H H H H H
charge: 0.122261 -0.260684 -0.198962 0.289043 -0.057394 -0.166180 -0.702045 -0.698099 0.201351 -0.498785 -0.621482 0.236458 0.273033 0.231456 0.232448 0.217036 0.223446 0.214465 0.232391 0.248252 0.244123 0.237868
chargesum: 0.00000
title: Mulliken charges with hydrogens summed into heavy atoms:
elementType: S O O N C C C C C C C
charge: 0.122261 -0.260684 -0.198962 0.289043 0.179064 0.106853 -0.021105 -0.027798 0.201351 0.231458 -0.621482
polarizability: 1.51606631e+02 1.50072397e+01 9.22507226e+01 -7.25082731e+00 -5.56226874e+00 7.33406252e+01
1716.lowfreq: -19.8759 -15.0249 -10.3733 -9.7570 -0.0033 -0.0010 0.0019 2.4553 34.0321
frequency: -19.7137 -14.1599 33.9334 68.2042 87.0337 107.7144 184.4523 194.7591 213.4563 221.0893 254.4155 294.3402 312.9259 355.9188 389.5106 392.2346 399.7061 520.9351 623.2910 694.3619 736.3382 808.7427 858.1406 925.0686 935.9095 957.0608 971.5417 1069.6561 1113.4726 1118.7463 1129.1972 1152.3967 1171.4620 1184.7422 1239.7577 1299.6374 1322.4774 1345.0615 1385.3267 1404.1108 1427.5686 1455.5486 1464.8254 1465.9097 1471.9120 1482.4578 1487.7729 1661.0647 2220.2267 2980.4247 2980.5507 2985.8971 3006.5563 3010.7786 3075.0280 3081.4008 3082.0975 3088.5745 3109.1529 3150.5869
redmass: 7.9217 5.9620 4.2281 2.8130 1.1837 2.9341 2.6243 1.3978 3.2142 1.1566 3.0369 5.0284 4.4848 5.7588 4.6725 3.7210 11.7636 3.3900 5.3404 5.5879 5.0662 3.6403 4.6265 1.2218 3.0227 1.6807 2.8249 1.7396 2.0549 1.3557 5.9465 1.4432 2.4307 2.4282 1.2772 1.3357 1.4842 1.4303 1.2077 1.2083 1.1724 1.0489 1.0480 1.0454 1.0506 1.0427 1.0550 9.8497 12.5875 1.0539 1.0622 1.0368 1.0303 1.0843 1.0998 1.0996 1.0998 1.0991 1.1047 1.1048
irintensity: 0.0973 0.6818 0.3754 0.1780 0.3364 0.8782 3.1056 2.7175 4.3261 1.3405 4.1237 11.5699 0.1758 6.8455 3.0331 1.3183 0.5510 5.8671 10.3758 21.5294 43.4124 15.7202 1.0908 2.7558 11.1761 2.5669 16.3530 19.3298 1.3314 2.2112 308.5110 16.4789 30.5281 13.6414 24.8323 8.9408 6.4182 21.9240 21.0893 14.0837 14.6017 15.2288 14.5015 1.0348 4.7811 16.3441 12.8235 141.3193 1054.3705 31.1087 17.1456 11.8259 33.2616 11.7946 24.5787 30.3488 11.0468 62.8365 23.2779 13.5662
temp: 298.150 k
press: 1.00000 atm
elementType: 16 8 8 7 6 6 6 6 6 6 6 1 1 1 1 1 1 1 1 1 1 1
symmnumber: 1
zpe: 449589.3 jmol-1
zpe.correction: 0.171240 hartree
zpe.thermalcorrener: 0.183201 hartree
zpe.thermalcorrenthalpy: 0.184145 hartree
zpe.thermalcorrgfe: 0.132033 hartree
zpe.sumelectzpe: -875.739567 hartree
zpe.sumelectthermal: -875.727605 hartree
zpe.sumelectthermalent: -875.726661 hartree
zpe.sumelectthermalfe: -875.778773 hartree
dipole: 5.1193 2.5761 -1.2036
dipole: 5.8559
quadrupole: -72.2751 -73.2511 -73.2667
quadrupole: -6.5655 0.0870 2.9668
quadrupole: 0.6558 -0.3201 -0.3358 -6.5655 0.0870 2.9668
hfenergy: -875.9108065 hartree
pointgroup: C01 [X(C7H11N1O2S1)]
dipole: 1.6793411 -1.1667914 1.0613138 debye
dipolederiv: -0.8130497 0.3796797 -0.2766854 0.3403926 -0.2766494 0.1298569 -0.3287996 0.1726656 -0.2265367 -1.4666867 -0.0453034 -0.3924244 -0.0509453 -0.3525458 0.102972 -0.3977902 0.0915267 -0.579518 -0.6256611 -0.1404422 0.0190739 -0.0020436 -0.5093416 0.2714278 -0.1522807 0.2693256 -0.6512447 -1.6916724 0.7590699 -0.6017195 0.7873492 -0.6695866 0.3203047 -0.6876725 0.3573558 -0.4385684 -0.0460339 -0.0033877 -0.0310391 0.0609308 0.328374 -0.0145507 -0.0294009 0.0541856 0.118523 0.7586471 -0.4531509 0.2587928 -0.4842101 0.200925 -0.0348393 0.3538649 -0.068748 0.3150182 0.0646799 -0.0154791 0.0501622 -0.0046629 -0.0293022 -0.0094896 0.0092596 -0.0189961 -0.0913265 0.0060638 -0.0173871 0.0354408 -0.0821113 -0.0512008 0.0188575 0.0610408 -0.0199265 0.042133 1.4782833 0.2845943 0.3143019 0.091635 0.4910593 -0.3992237 0.4713226 -0.4117486 0.9038256 0.6690816 0.0780996 0.0707309 0.1431015 0.2728107 0.0493566 -0.0513562 0.0326097 0.2217246 1.842123 -0.9877731 0.7826027 -0.9443782 0.4781229 -0.3976453 0.8767547 -0.4665233 0.3423872 -0.0984911 0.042362 -0.0721535 0.0946271 0.0175319 0.0308582 -0.0646067 0.0113426 -0.0038023 -0.0411264 0.0711754 -0.0218581 0.0587424 0.0663902 -0.0120232 -0.0798835 0.0022545 -0.0957239 -0.0712571 0.0414397 -0.101936 0.0509308 0.0980259 0.0345032 -0.0591365 0.021769 0.0324955 -0.0638374 -0.082492 0.0874525 -0.1019927 0.0613037 0.06141 0.0741982 0.0511315 0.0161673 0.0943101 0.0197135 -0.004404 0.0391265 -0.1751536 -0.0582144 0.0017913 -0.0361592 0.0764496 0.0654007 0.0131852 0.0146134 0.0037876 -0.184587 -0.0036394 0.0162512 -0.0403261 0.0910061 0.0656051 -0.0117639 0.0048204 -0.0141793 0.0931915 -0.0734537 0.0393431 -0.0237029 -0.1743724 -0.0895579 0.0307979 -0.0496212 0.0581989 0.0989981 0.0301115 -0.0979272 0.0343648 0.0436527 -0.001597 0.034064 -0.0062862 -0.0680812 -0.1082591 -0.0350208 0.0405131 -0.0002724 0.1092009 -0.006203 -0.0150712 -0.0006458 -0.0213893 0.0610528 -0.0761207 0.1153738 -0.0645107 -0.0600303 -0.0290206 0.0180693 -0.0792185 0.0451715 0.08884 0.0645624 -0.1108593 0.0523826 0.0085396 unknown
polarizability: 139.7357697|-18.6646277|94.0426094|22.7461574|-14.6737101|83.4196 unknown
InChI: InChI=1S/C7H11NO2S/c1-5(2)6(8-4-11)7(9)10-3/h5-6H,1-3H3
charge 0 multiplicity 1
22 atoms
S  -3.608322 1.628587 -1.117423
O  2.215758 0.267696 0.907178
O  1.253778 1.350518 -0.921642
N  -1.277078 0.465672 0.00377
C  -0.02207 -1.667752 0.27983
C  -0.1155 -0.122433 0.569019
C  0.056741 -1.968665 -1.232613
C  -1.205615 -2.404722 0.945952
C  1.156118 0.601996 0.068771
C  3.52985 0.852398 0.556114
C  -2.261677 0.964287 -0.475321
H  0.918811 -1.991724 0.766018
H  -0.140322 0.001365 1.671172
H  -0.864659 -1.644932 -1.749492
H  0.910191 -1.459773 -1.715909
H  0.172559 -3.055178 -1.395047
H  -1.107074 -3.494666 0.795251
H  -1.244675 -2.215202 2.034923
H  -2.16949 -2.089522 0.507011
H  3.475028 1.953555 0.581171
H  3.837827 0.527075 -0.451809
H  4.221823 0.47442 1.321375
