program: Gaussian 09
title: 000145491
version: EM64L-G09RevD.01
frameworkgroup: C1[X(C20H30N2)]
method: RPBEPBE
basis: SDD
operation: Freq
keyword: #pfreq=noraman
keyword: PBEPBE/SDD
title: #p freq=noraman PBEPBE/SDD
converged: NO YES NO NO
title: Mulliken charges:
elementType: N N C C C C C C C C C C C C C C C C C C C C H H H H H H H H H H H H H H H H H H H H H H H H H H H H H H
charge: -0.112665 -0.187327 0.088724 0.076717 0.124421 0.185622 0.107309 -0.414620 -0.399199 0.082747 0.483642 -0.384391 -0.380418 -0.404203 -0.551289 -0.614473 -0.712504 -0.712924 -0.715415 -0.707516 -0.707015 -0.738478 0.206356 0.291644 0.246461 0.219638 0.207368 0.218539 0.218137 0.207435 0.226439 0.193312 0.237563 0.241334 0.230604 0.208655 0.224726 0.230714 0.223921 0.208630 0.195737 0.223606 0.221727 0.220260 0.202818 0.213043 0.213218 0.220530 0.202794 0.212511 0.211930 0.213604
chargesum: 0.00000
title: Mulliken charges with hydrogens summed into heavy atoms:
elementType: N N C C C C C C C C C C C C C C C C C C C C
charge: -0.112665 -0.187327 0.088724 0.076717 0.124421 0.185622 0.107309 0.083380 0.066900 0.082747 0.483642 0.041516 0.045154 0.015548 -0.313726 -0.373138 -0.048519 -0.049659 -0.074345 -0.071395 -0.070473 -0.100433
polarizability: 3.37002392e+02 2.81608074e+00 2.61330095e+02 7.82327211e+00 3.31318943e+00 1.60583057e+02
1716.lowfreq: -14.1619 -9.7435 -0.0006 -0.0005 -0.0003 7.7499 16.1975 20.8577 26.2849
frequency: 14.3569 20.6769 25.2798 40.1677 67.5325 85.3893 100.4388 126.7374 137.7486 173.0613 177.9809 205.3566 208.4024 228.8580 230.2518 236.0399 237.9438 258.1277 267.1429 273.6356 289.3544 293.0842 295.7024 331.1062 336.5804 353.4218 371.1688 381.9049 403.3323 416.7548 427.1254 444.9826 470.4629 498.8145 540.5534 549.5635 587.2006 611.5057 630.6598 666.6258 709.8375 736.9927 744.6918 745.2514 796.5359 812.1820 813.9195 824.2199 837.9733 847.3103 847.8086 901.9908 913.5349 917.0484 924.4594 927.9845 929.5553 934.0797 939.1052 945.1583 950.3619 1003.7855 1014.3301 1018.9884 1019.8154 1022.2293 1041.3427 1043.7699 1087.4575 1101.4137 1115.3190 1128.6823 1152.5308 1153.4708 1176.5843 1196.5791 1204.1467 1207.3176 1219.5456 1223.8181 1237.1599 1251.8515 1268.3134 1269.0404 1280.9066 1322.8358 1327.5693 1336.0941 1341.3606 1346.6750 1353.0819 1368.2211 1369.1019 1371.4726 1374.7590 1375.2197 1392.4328 1397.3576 1416.8073 1445.2901 1450.1796 1453.4008 1455.8735 1460.5894 1462.0878 1462.8364 1463.5521 1465.1269 1466.0575 1466.5503 1469.9591 1470.6727 1474.7740 1475.2435 1477.8751 1481.8772 1496.2946 1498.8093 1525.5469 1625.0695 2961.2584 2964.8851 2966.3536 2968.1328 2970.1549 2972.0805 2977.4834 2978.8507 2984.8139 2991.7786 2992.3129 3041.1397 3052.6239 3058.9692 3060.4925 3062.2416 3064.8657 3070.9971 3072.7015 3073.7763 3074.5985 3077.0902 3081.9451 3085.9810 3091.5919 3095.5276 3096.7533 3116.1542 3163.0215 3175.8203
redmass: 2.9906 2.8341 2.9018 3.2442 3.7281 3.5629 3.3449 3.0803 3.7447 1.0479 2.5511 1.4021 1.7504 2.0120 2.4318 1.1324 1.5222 1.3701 1.8608 2.0821 2.4398 2.7307 1.0485 2.5412 2.6411 2.6704 2.2525 2.5547 2.4074 2.7550 3.1746 2.9986 3.0941 2.2557 2.9566 3.1110 4.7481 3.0207 2.3307 5.3278 9.5998 5.9026 5.1257 5.4948 1.5449 1.7632 2.6644 2.9214 1.6290 1.4815 2.3982 2.6086 1.7560 3.1793 1.7709 1.7990 2.7260 1.9108 1.2002 1.3395 1.1993 2.5221 1.6608 1.4555 1.4638 1.3895 1.9723 2.3714 1.3823 1.7973 3.0359 2.2767 2.6668 1.3068 1.8061 2.7927 2.9546 2.1507 2.4758 2.4392 2.6624 1.3095 1.6282 1.5105 1.8849 2.6351 1.5023 1.3676 1.4658 1.4778 1.5154 1.3248 1.3796 1.1801 2.2180 1.3736 1.5155 1.2599 2.6384 3.0391 1.0503 1.1087 1.0520 1.1989 1.0872 1.0488 1.1497 1.0592 1.3555 1.1556 1.5763 1.0662 1.0959 1.0697 1.0728 1.0539 1.1476 1.1912 5.1240 8.8110 1.0688 1.0346 1.0346 1.0699 1.0647 1.0358 1.0344 1.0350 1.0362 1.0611 1.0609 1.0960 1.1028 1.0995 1.1032 1.0996 1.1005 1.0984 1.1003 1.0997 1.0997 1.0994 1.0988 1.1004 1.0991 1.0990 1.0948 1.0921 1.0946 1.0950
irintensity: 0.3095 0.3211 0.0102 0.1401 1.5118 0.3014 0.2285 0.1137 1.1992 0.0006 0.5492 0.2505 0.8933 0.2781 0.1819 0.2873 0.1518 0.2678 0.7770 0.9825 1.8986 0.3667 0.0264 1.8899 0.0635 2.8651 0.3643 0.9962 0.8432 3.2702 0.5172 1.0939 0.3826 2.7773 8.0020 4.0337 0.3864 0.7070 22.2854 1.7472 7.3413 1.1858 1.2307 13.5781 0.4157 7.2372 4.0569 3.6443 14.0358 24.8400 15.5306 11.8203 1.5236 32.7149 2.3535 13.8138 58.1527 7.1308 0.1059 11.3961 0.0905 18.4951 4.6807 6.3215 7.3425 0.3338 27.1650 5.4140 0.0247 15.6390 0.4437 41.6443 22.6293 0.1398 13.1838 5.2922 9.0900 31.6809 29.7619 76.8904 7.2371 24.1827 7.0669 122.4489 53.7580 24.2628 13.0814 1.5987 3.1018 2.2680 30.0598 17.4017 16.4191 19.3964 32.2883 41.4894 20.4772 7.4487 21.9071 82.5098 0.1241 11.8785 0.1528 23.6096 7.5657 0.0780 14.3743 2.9034 56.8348 3.2366 14.8240 11.1182 5.1116 24.0999 15.1238 10.5420 27.2756 83.2165 106.1755 715.3201 38.1527 33.6542 46.6055 45.3238 72.2344 44.5837 31.2947 22.4143 53.6816 21.6670 32.7192 65.7953 26.4435 3.4104 87.2586 28.7746 13.3553 157.8970 7.8147 47.5980 6.5094 40.1597 92.8199 1.0485 50.5316 35.7004 6.4560 5.9507 14.0862 11.0172
temp: 298.150 k
press: 1.00000 atm
elementType: 7 7 6 6 6 6 6 6 6 6 6 6 6 6 6 6 6 6 6 6 6 6 1 1 1 1 1 1 1 1 1 1 1 1 1 1 1 1 1 1 1 1 1 1 1 1 1 1 1 1 1 1
symmnumber: 1
zpe: 1189916.4 jmol-1
zpe.correction: 0.453215 hartree
zpe.thermalcorrener: 0.476809 hartree
zpe.thermalcorrenthalpy: 0.477753 hartree
zpe.thermalcorrgfe: 0.399359 hartree
zpe.sumelectzpe: -887.912677 hartree
zpe.sumelectthermal: -887.889083 hartree
zpe.sumelectthermalent: -887.888139 hartree
zpe.sumelectthermalfe: -887.966533 hartree
dipole: -3.1121 -2.0786 -0.0346
dipole: 3.7426
quadrupole: -122.2228 -126.8149 -137.6533
quadrupole: 10.6458 1.3771 1.5540
quadrupole: 6.6742 2.0821 -8.7563 10.6458 1.3771 1.5540
hfenergy: -888.3658921 hartree
pointgroup: C01 [X(C20H30N2)]
dipole: 1.3871488 -0.4933357 0.023347 debye
polarizability: 333.9228369|15.7034576|264.25424|6.6660652|-5.3610682|160.7384678 unknown
InChI: InChI=1S/C20H30N2/c1-19(2,3)14-12-15-16(13-14)18(21-17(15)20(4,5)6)22-10-8-7-9-11-22/h12-13H,7-11H2,1-6H3
charge 0 multiplicity 1
52 atoms
N  2.489107 -0.228368 0.473498
N  1.018915 1.646326 0.149131
C  -0.021779 -0.489558 0.22705
C  -1.023214 0.527098 0.026479
C  1.218917 0.21566 0.297031
C  -0.93447 3.188245 -0.207334
C  -0.318207 1.811183 -0.012461
C  3.649653 0.694574 0.537989
C  2.814703 -1.666897 0.581257
C  -3.203154 -2.581999 0.063424
C  -2.084976 -1.536514 0.091198
C  4.695749 0.326236 -0.538497
C  3.846643 -2.071051 -0.499292
C  5.098455 -1.164305 -0.438419
C  -0.693364 -1.767866 0.265008
C  -2.287638 -0.105817 -0.057476
C  -1.951164 3.445735 0.947596
C  -1.691095 3.207464 -1.571321
C  0.146569 4.295686 -0.199929
C  -3.951137 -2.516207 -1.3025
C  -4.221547 -2.294901 1.208163
C  -2.638889 -4.013869 0.250711
H  4.104208 0.606283 1.547202
H  3.259543 1.715273 0.40861
H  1.889053 -2.251502 0.484706
H  3.237675 -1.856382 1.589989
H  5.580778 0.978291 -0.414325
H  4.270028 0.53457 -1.538946
H  3.372444 -1.988514 -1.496124
H  4.123713 -3.131972 -0.351025
H  5.80108 -1.429581 -1.249974
H  5.633132 -1.338101 0.5187
H  -0.241425 -2.752001 0.405365
H  -3.257881 0.376512 -0.204211
H  -2.744534 2.678548 0.966137
H  -2.424038 4.436463 0.812667
H  -1.441994 3.434955 1.928239
H  -2.482507 2.438739 -1.605174
H  -0.995723 3.018738 -2.409121
H  -2.157816 4.198558 -1.723629
H  -0.330107 5.284846 -0.335368
H  0.705289 4.297189 0.751746
H  0.879259 4.140001 -1.010473
H  -3.258424 -2.724994 -2.138172
H  -4.772106 -3.258649 -1.334017
H  -4.389511 -1.515299 -1.469711
H  -4.662081 -1.286233 1.106904
H  -3.726272 -2.349215 2.194846
H  -5.047438 -3.032253 1.189231
H  -2.115468 -4.114539 1.219874
H  -1.927988 -4.273288 -0.556033
H  -3.461065 -4.753295 0.229879
