program: Gaussian 09
title: 000145468
version: EM64L-G09RevD.01
frameworkgroup: C1[X(C8H6INO3)]
method: RPBEPBE
basis: SDD
operation: Freq
keyword: #p
keyword: freq=noraman
keyword: PBEPBE/SDD
title: #p freq=noraman PBEPBE/SDD
converged: NO YES NO NO
title: Mulliken charges:
elementType: I O O O N C C C C C C C C H H H H H H
charge: 0.120918 -0.168809 -0.197006 -0.193686 0.029636 0.314683 -0.312408 -0.316403 0.386526 -0.361332 -0.354644 0.240898 -0.926387 0.252575 0.292355 0.292220 0.294365 0.303096 0.303403
chargesum: 0.00000
title: Mulliken charges with hydrogens summed into heavy atoms:
elementType: I O O O N C C C C C C C C
charge: 0.120918 -0.168809 -0.197006 -0.193686 0.029636 0.314683 -0.059833 -0.024048 0.386526 -0.069112 -0.060279 0.240898 -0.319888
polarizability: 2.29333708e+02 -9.95550077e+00 1.17341993e+02 -2.29429135e-02 -1.24812340e-01 4.69944258e+01
1716.lowfreq: -12.6752 -1.5226 0.0002 0.0004 0.0005 1.7651 22.4331 50.6324 69.2217
frequency: 22.4039 50.6311 69.2178 80.1331 86.1007 139.1458 206.4897 234.2146 285.2580 370.9151 404.8920 430.7316 486.0796 514.9332 547.7745 606.1790 622.9515 665.1153 675.8705 734.8001 743.9284 798.9656 826.8732 861.3176 895.9390 983.3313 992.1548 1005.6707 1015.6537 1089.8207 1111.7814 1123.6583 1174.5064 1183.2755 1215.8338 1248.0450 1299.1522 1370.5658 1402.0724 1403.3877 1411.7850 1473.6345 1585.8531 1601.0418 1620.3105 3031.5517 3105.3559 3158.8810 3164.5011 3185.6463 3188.3438
redmass: 9.0237 5.4469 4.9627 9.8165 4.8052 18.5258 9.5931 6.2495 9.1046 8.3128 2.8568 3.5233 9.3463 6.4892 2.3967 6.1464 7.1365 4.4251 7.0168 3.6290 8.2990 8.4107 1.6766 1.3284 1.7174 4.3855 1.3676 2.7808 1.3547 3.2752 1.3291 1.1640 1.7774 1.3098 5.7142 2.4175 1.2757 7.0342 1.1688 7.9933 3.8050 2.2987 8.4212 6.6347 8.7397 1.0569 1.1052 1.0894 1.0900 1.0952 1.0966
irintensity: 0.3867 5.8912 4.5585 1.5388 0.4331 0.8881 4.0681 1.3767 2.2047 3.5303 0.0259 2.7754 10.6224 1.7861 2.0989 33.0563 0.8035 22.5251 14.9933 14.1022 18.9799 25.0980 55.2333 5.0083 20.0887 72.6756 2.6050 0.2339 0.0685 10.5482 14.6371 4.0215 175.8374 0.3354 293.8328 32.4065 1.2824 73.8532 10.0868 1.1840 105.3834 0.0476 34.7347 7.1330 42.5098 24.2083 0.0721 6.2338 2.9227 1.4638 1.8722
temp: 298.150 k
press: 1.00000 atm
elementType: 53 8 8 8 7 6 6 6 6 6 6 6 6 1 1 1 1 1 1
symmnumber: 1
zpe: 332003.6 jmol-1
zpe.correction: 0.126454 hartree
zpe.thermalcorrener: 0.138428 hartree
zpe.thermalcorrenthalpy: 0.139372 hartree
zpe.thermalcorrgfe: 0.084382 hartree
zpe.sumelectzpe: -599.358452 hartree
zpe.sumelectthermal: -599.346477 hartree
zpe.sumelectthermalent: -599.345533 hartree
zpe.sumelectthermalfe: -599.400523 hartree
dipole: -1.6255 -2.1194 0.0143
dipole: 2.6710
quadrupole: -125.2118 -88.0260 -89.1740
quadrupole: 7.0740 0.0431 -0.0350
quadrupole: -24.4079 12.7779 11.6300 7.0740 0.0431 -0.0350
hfenergy: -599.4849051 hartree
pointgroup: C01 [X(C8H6I1N1O3)]
dipole: -0.5759823 0.8762697 -0.0686348 debye
dipolederiv: -0.2859675 0.0304809 0.0013454 -0.0281002 0.0159909 -0.0031372 0.0074501 -0.0042577 -0.0286163 -0.7455255 -0.0874527 0.0121412 -0.1272706 -0.6823906 0.0335131 0.0157834 0.0338292 -0.2750627 -0.7377048 -0.1901637 0.0217025 -0.1811206 -0.6677819 0.0395798 0.0207358 0.0397448 -0.2244228 -0.7757033 0.1923552 -0.0100165 0.1666833 -0.6306059 0.033072 -0.0077981 0.0323941 -0.2211638 1.8578602 0.0249624 -0.0205248 0.0455063 1.0845348 -0.0760393 -0.0216495 -0.0753274 0.1987199 -0.5893406 -0.0053776 0.0071849 0.2012214 -0.0033814 -0.0023059 -0.0096232 0.0006433 0.0080496 -0.0505644 -0.1979366 0.0157159 -0.041809 -0.0046437 -0.0093912 0.0035337 -0.007575 -0.1217555 -0.2005485 0.2237053 -0.0166499 -0.0357769 0.0302604 -0.0085966 0.0034339 -0.0115947 -0.0824172 -0.6135201 -0.0247858 0.0097836 -0.0533846 0.1196363 -0.0031045 0.0116176 -0.0034935 0.0709661 0.0039352 0.1750429 -0.0155688 -0.0493664 -0.0545768 -0.0030829 0.0029941 -0.0056518 -0.0991398 0.0508594 -0.1975091 0.0147293 0.1226641 -0.062945 -0.0049042 -0.011957 -0.0014596 -0.1037686 1.4316154 0.0344611 -0.0166839 -0.5556905 0.8913714 -0.0522193 0.0324194 -0.0619249 0.1376989 0.4659164 0.1065522 -0.0173657 0.5029146 -0.3569222 0.0234243 -0.0532177 0.029752 0.0080506 0.0611595 0.0813297 -0.006006 0.1227755 -0.0021123 0.0103575 -0.0093107 0.0108973 0.1413955 0.1173851 -0.0597437 0.0052368 -0.0222182 0.0472876 0.0089442 0.0024061 0.00932 0.1524562 0.1068834 -0.0499191 0.0048369 -0.0226499 0.0645515 0.0091313 0.0024691 0.0095356 0.1723996 0.0877642 0.0580533 -0.0038436 0.022895 0.0793707 0.0074057 -0.0008529 0.007161 0.1722336 -0.0951422 -0.0655484 -0.0804635 -0.0396883 0.0579996 -0.0485406 -0.0523046 -0.0471365 0.057516 -0.0893618 -0.0485061 0.0944462 -0.027585 0.0743569 0.0458939 0.0638705 0.0451436 0.0368605 unknown
polarizability: 230.159895|1.3737992|116.0159642|-2.4726258|-5.6936812|47.4942672 unknown
InChI: InChI=1S/C8H6INO3/c9-5-8(11)6-1-3-7(4-2-6)10(12)13/h1-4H,5H2
charge 0 multiplicity 1
19 atoms
I  -5.43594 0.672301 0.020353
O  -2.969606 -1.431282 0.145974
O  3.877277 1.272765 -0.151825
O  4.007211 -0.996821 0.037495
N  3.342045 0.104043 -0.047365
C  -0.945747 -0.132968 0.017683
C  -0.299491 1.128439 -0.092484
C  -0.160147 -1.315606 0.106119
C  1.854122 0.020096 -0.024487
C  1.106028 1.212498 -0.114368
C  1.24324 -1.248624 0.085875
C  -2.450696 -0.290611 0.047884
C  -3.275581 0.996447 -0.045847
H  -0.880793 2.052841 -0.162259
H  -0.679639 -2.275048 0.190289
H  1.627529 2.169293 -0.198457
H  1.866815 -2.143695 0.152994
H  -3.043812 1.674886 0.792547
H  -3.075513 1.521946 -0.995123
