program: Gaussian 09
title: 000145448
version: EM64L-G09RevD.01
frameworkgroup: C1[X(C18H26N2)]
method: RPBEPBE
basis: SDD
operation: Freq
keyword: #pfreq=noraman
keyword: PBEPBE/SDD
title: #p freq=noraman PBEPBE/SDD
converged: YES YES NO NO
title: Mulliken charges:
elementType: N N C C C C C C C C C C C C C C C C C C H H H H H H H H H H H H H H H H H H H H H H H H H H
charge: -0.099805 -0.099538 0.218235 0.218308 -0.213800 -0.213276 -0.118910 -0.121439 -0.118677 -0.121306 -0.553458 -0.559921 -0.554024 -0.560366 -0.487212 -0.489428 -0.487165 -0.489385 -0.420735 -0.420738 0.243150 0.243059 0.215761 0.218567 0.215751 0.218583 0.230787 0.229430 0.222882 0.236553 0.230343 0.230452 0.223006 0.236361 0.211293 0.216953 0.217740 0.213289 0.211423 0.216879 0.217696 0.213331 0.194881 0.194826 0.194904 0.194737
chargesum: 0.00000
title: Mulliken charges with hydrogens summed into heavy atoms:
elementType: N N C C C C C C C C C C C C C C C C C C
charge: -0.099805 -0.099538 0.218235 0.218308 0.029350 0.029783 0.096851 0.097128 0.097074 0.097277 -0.093240 -0.100486 -0.093229 -0.100999 -0.058966 -0.058399 -0.058863 -0.058357 -0.031028 -0.031098
polarizability: 2.49101239e+02 5.93427201e+00 1.69299253e+02 1.67341331e-02 2.31039393e-03 1.65463765e+02
1716.lowfreq: -7.1610 -5.6340 0.0005 0.0005 0.0006 9.2598 22.4861 50.5013 65.6622
frequency: 19.7384 50.4796 65.3059 80.5656 163.5813 190.1472 254.5879 283.6839 296.4092 339.3337 371.0172 386.5761 389.9276 425.6086 434.7545 442.0580 478.7347 485.0667 494.1797 505.9457 509.1828 526.3582 540.3901 616.9326 658.5051 659.3283 770.3491 771.3054 779.2983 779.9298 794.4842 807.7512 827.3316 843.3563 843.7940 859.2408 859.6947 884.8998 885.0775 887.6044 890.8276 926.3494 928.0152 937.1725 946.2421 950.1864 950.5054 951.5987 961.4194 991.0476 991.5975 999.3478 1007.5421 1027.1664 1028.8190 1031.8606 1043.3519 1052.6006 1055.9895 1077.7547 1082.4568 1097.9190 1098.6342 1110.4699 1111.4456 1120.5540 1122.0486 1126.8010 1132.4749 1173.2610 1195.6555 1208.0123 1212.6814 1228.6979 1234.6850 1235.3298 1239.3978 1245.7908 1246.1735 1250.9813 1251.7428 1277.6238 1277.7038 1292.5154 1292.6202 1295.3764 1295.7429 1303.1039 1303.4140 1313.2601 1315.9210 1334.9743 1335.0502 1338.8213 1338.9085 1450.5511 1454.5970 1455.2116 1461.9437 1462.2292 1475.1403 1475.6469 1476.6491 1477.0820 1498.6470 1498.7688 2970.9589 2971.0382 2988.6234 2988.7972 2991.4934 2991.6435 2996.4973 2996.9876 3006.6948 3006.9082 3025.1907 3025.3601 3027.0406 3027.1486 3030.5464 3031.2508 3049.3496 3049.3779 3056.3153 3056.5679 3063.4975 3063.8693 3065.8629 3066.1140 3074.7255 3075.0113
redmass: 3.3361 3.9084 3.9903 4.3758 3.5351 4.1421 2.6503 2.4588 2.9505 2.3281 2.3842 1.9530 2.1788 2.3527 3.4913 4.2432 4.8026 2.3564 2.5321 1.7958 1.7325 3.7111 3.7391 5.3143 4.1963 4.1462 3.2995 3.0091 3.7630 3.8830 3.7863 3.2739 3.9171 2.5816 2.4994 2.4367 2.4328 1.6021 1.5915 1.7229 1.8577 2.1169 2.0605 2.1604 2.2764 1.9637 1.9777 2.0760 2.1190 1.9085 1.7927 1.8254 1.7358 2.0673 1.3646 1.5478 1.7701 1.2978 1.2583 1.7296 1.7729 1.1040 1.1273 1.7983 1.5507 1.2107 1.2446 1.3907 1.5328 1.9723 1.6908 1.3604 1.5721 1.5803 1.7171 1.9532 1.8187 2.0709 2.1298 1.6602 1.8065 1.5947 1.6091 1.5070 1.4897 1.4846 1.4803 1.6626 1.6640 1.6109 1.6820 1.4118 1.4106 1.5767 1.5766 7.3288 1.0882 1.1223 1.0851 1.1034 1.0914 1.1013 1.0928 1.0970 1.0921 1.0922 1.0606 1.0606 1.0606 1.0605 1.0610 1.0611 1.0602 1.0604 1.0636 1.0637 1.0846 1.0844 1.1027 1.1027 1.0854 1.0853 1.1050 1.1050 1.0982 1.0984 1.0943 1.0940 1.1051 1.1051 1.1036 1.1035
irintensity: 0.0705 0.3133 0.6614 0.1412 0.0532 0.0043 0.8192 0.4168 1.1686 0.3950 0.3671 0.0247 0.4964 1.8855 2.4695 0.9762 0.3093 1.9241 0.1038 0.2013 0.3042 1.7158 3.7453 3.7698 0.1294 0.2804 1.6855 15.7441 0.0547 0.3279 0.6942 1.5400 0.8874 2.2778 2.7274 4.9380 2.6769 0.4349 0.3867 4.8780 0.1442 0.6794 0.0068 0.8224 0.6713 2.4493 3.0991 0.0697 3.7872 7.2865 0.7484 0.8711 0.0340 0.1883 0.1008 0.0290 0.4458 3.1210 4.0134 11.1522 25.0533 0.8661 0.7911 5.6992 0.4228 0.5572 0.6584 3.1405 0.6267 1.0296 0.0040 8.0624 0.0002 0.7889 0.0709 0.1894 0.0071 0.4254 12.9523 6.5814 0.4543 0.7276 0.6522 5.7125 2.3848 2.0761 1.7385 15.0700 4.2697 4.7472 0.1179 2.5758 1.5496 0.2113 0.3314 0.0385 0.4975 0.9746 16.8374 1.3339 33.4457 16.0823 5.5133 13.4849 1.4806 1.5794 76.9953 14.1756 9.8304 40.1249 60.0543 39.3796 16.1560 17.2894 18.2925 34.4760 79.0434 168.6308 29.0157 31.0395 132.5824 23.8527 18.5010 4.6672 82.6919 58.6889 63.4543 2.2835 17.8874 31.3623 22.9378 50.7376
temp: 298.150 k
press: 1.00000 atm
elementType: 7 7 6 6 6 6 6 6 6 6 6 6 6 6 6 6 6 6 6 6 1 1 1 1 1 1 1 1 1 1 1 1 1 1 1 1 1 1 1 1 1 1 1 1 1 1
symmnumber: 1
zpe: 1070271.9 jmol-1
zpe.correction: 0.407645 hartree
zpe.thermalcorrener: 0.422867 hartree
zpe.thermalcorrenthalpy: 0.423812 hartree
zpe.thermalcorrgfe: 0.364879 hartree
zpe.sumelectzpe: -809.451311 hartree
zpe.sumelectthermal: -809.436088 hartree
zpe.sumelectthermalent: -809.435144 hartree
zpe.sumelectthermalfe: -809.494077 hartree
dipole: 0.0007 0.0011 -0.0350
dipole: 0.0350
quadrupole: -112.3025 -121.7972 -118.7124
quadrupole: 0.1099 0.0126 0.0244
quadrupole: 5.3015 -4.1932 -1.1084 0.1099 0.0126 0.0244
hfenergy: -809.8589557 hartree
pointgroup: C01 [X(C18H26N2)]
dipole: -0.0002751 -0.0137641 0.0004116 debye
polarizability: 249.2770571|-0.0821249|165.4638418|-4.5986794|0.0058128|169.1233584 unknown
InChI: InChI=1S/C18H26N2/c1-11-3-15-4-12(1)8-17(15,7-11)19-20-18-9-13-2-14(10-18)6-16(18)5-13/h11-16H,1-10H2
charge 0 multiplicity 1
46 atoms
N  0.432546 -0.173087 -0.478703
N  -0.433732 -0.181559 0.477097
C  1.847576 -0.190776 -0.02276
C  -1.849028 -0.193742 0.021498
C  2.691686 0.979264 -0.731135
C  -2.686541 0.983083 0.729471
C  3.61363 0.493848 1.425367
C  4.013401 -1.013237 -0.641693
C  -3.612424 0.499373 -1.425893
C  -4.018789 -1.00258 0.643775
C  2.158718 -0.04389 1.493951
C  2.545256 -1.499845 -0.517144
C  -2.160451 -0.046002 -1.494845
C  -2.553472 -1.497233 0.518585
C  3.398787 1.692263 0.459686
C  3.788983 0.22979 -1.544141
C  -3.390355 1.698029 -0.462008
C  -3.786888 0.240537 1.544255
C  4.548942 -0.568204 0.757979
C  -4.552967 -0.556621 -0.756248
H  2.055985 1.639764 -1.342656
H  -2.046682 1.641034 1.339437
H  4.011873 0.791754 2.412744
H  4.68004 -1.771123 -1.09247
H  -4.009818 0.798175 -2.413346
H  -4.689278 -1.75612 1.096086
H  2.052126 -0.999136 2.036395
H  1.48466 0.689704 1.972125
H  2.152419 -1.802882 -1.50568
H  2.395382 -2.332388 0.1927
H  -2.059503 -1.002665 -2.036165
H  -1.48286 0.683409 -1.974098
H  -2.160883 -1.800743 1.507049
H  -2.409674 -2.332207 -0.189733
H  2.749533 2.452685 0.934101
H  4.334553 2.189561 0.145199
H  4.693204 0.849327 -1.685807
H  3.425207 -0.082106 -2.541557
H  -2.737373 2.454297 -0.937881
H  -4.32315 2.200783 -0.147292
H  -4.687668 0.865101 1.685795
H  -3.423935 -0.071891 2.541796
H  5.569209 -0.149425 0.647939
H  4.631254 -1.453262 1.420544
H  -5.570874 -0.132201 -0.646127
H  -4.640327 -1.442256 -1.41739
