program: Gaussian 09
title: 000145446
version: EM64L-G09RevD.01
frameworkgroup: CS[SG(C2H3P),X(H2)]
method: RPBEPBE
basis: SDD
operation: Freq
keyword: #p
keyword: freq=noraman
keyword: PBEPBE/SDD
title: #p freq=noraman PBEPBE/SDD
converged: NO YES NO NO
title: Mulliken charges:
elementType: P C C H H H H H
charge: 0.262477 -0.636795 -0.561774 0.235012 0.233254 0.233254 0.257689 -0.023117
chargesum: 0.00000
title: Mulliken charges with hydrogens summed into heavy atoms:
elementType: P C C
charge: 0.239360 0.064725 -0.304086
polarizability: 5.32600124e+01 1.32469017e+01 5.27891425e+01 -1.34222556e-08 -5.29688396e-08 2.61377709e+01
1716.lowfreq: -0.0042 -0.0035 0.0044 13.5451 19.6245 25.3463 195.3855 329.4354 510.5814
frequency: 195.3710 329.4354 510.5764 776.8864 853.9573 884.3894 1013.7169 1050.8200 1149.6642 1328.2498 1386.3064 1454.0589 1469.1360 2145.6158 2958.4235 3030.2371 3078.4988 3109.7221
redmass: 1.1664 3.0791 1.1513 2.6119 1.1275 1.1541 1.4753 1.4923 2.4319 1.6084 1.2015 1.0486 1.0796 1.0390 1.0371 1.0959 1.0973 1.0905
irintensity: 0.6121 3.0106 20.7199 2.4268 51.9771 18.6267 0.1410 10.2229 5.7774 27.0744 18.8170 18.3932 17.0978 121.1391 16.3639 21.3189 6.8605 20.8049
temp: 298.150 k
press: 1.00000 atm
elementType: 15 6 6 1 1 1 1 1
symmnumber: 1
zpe: 159851.4 jmol-1
zpe.correction: 0.060884 hartree
zpe.thermalcorrener: 0.065208 hartree
zpe.thermalcorrenthalpy: 0.066152 hartree
zpe.thermalcorrgfe: 0.034618 hartree
zpe.sumelectzpe: -420.154943 hartree
zpe.sumelectthermal: -420.150619 hartree
zpe.sumelectthermalent: -420.149675 hartree
zpe.sumelectthermalfe: -420.181208 hartree
dipole: 0.5508 1.6190 0.0000
dipole: 1.7102
quadrupole: -24.8550 -27.4364 -28.0851
quadrupole: 0.4177 0.0000 0.0000
quadrupole: 1.9372 -0.6443 -1.2929 0.4177 0.0000 0.0000
hfenergy: -420.2158267 hartree
pointgroup: CS [SG(C2H3P1),X(H2)]
dipole: 0.5513092 -0.3856975 0. debye
dipolederiv: -0.0972928 0.0824862 0. 0.125147 0.3506005 0. 0. 0. -0.0465923 -0.3081506 -0.0924505 0. 0.0314316 0.0175941 0. 0. 0. 0.0864265 0.4513714 -0.0868006 0. 0.1297373 -0.0495505 0. 0. 0. -0.3700883 0.0896833 0.0763447 0. -0.0322369 -0.112942 0. 0. 0. 0.1146308 -0.0013369 0.0109858 0.1019001 -0.0368571 0.1011997 -0.0683545 0.1305382 -0.0482715 -0.0357057 -0.0013369 0.0109858 -0.1019001 -0.0368571 0.1011997 0.0683545 -0.1305382 0.0482715 -0.0357057 -0.0122507 0.0332773 0. 0.015814 -0.1134961 0. 0. 0. 0.2477758 -0.1206868 -0.0348287 0. -0.1961788 -0.2946054 0. 0. 0. 0.0392589 unknown
polarizability: 65.7271338|-3.7657529|40.3220211|0.|0.|26.1377709 unknown
InChI: InChI=1S/C2H5P/c1-2-3/h2-3H,1H3
charge 0 multiplicity 1
8 atoms
P  -1.459845 0.241921 0.0000
C  1.389503 0.237459 0.0000
C  0.087742 -0.522722 0.0000
H  1.237386 1.330707 0.0000
H  1.998473 -0.029139 -0.887644
H  1.998473 -0.029139 0.887644
H  0.180961 -1.618586 0.0000
H  -2.255494 -0.992101 0.0000
