program: Gaussian 09
title: 000145422
version: EM64L-G09RevD.01
frameworkgroup: C1[X(C9H9NO2S)]
method: RPBEPBE
basis: SDD
operation: Freq
keyword: #p
keyword: freq=noraman
keyword: PBEPBE/SDD
title: #p freq=noraman PBEPBE/SDD
converged: NO YES NO NO
title: Mulliken charges:
elementType: S O O N C C C C C C C C C H H H H H H H H H
charge: 0.128561 -0.270394 -0.271826 0.299350 0.420891 0.397559 -0.517431 0.565033 -0.555720 -0.559755 -0.534976 -0.535063 -0.784269 0.269975 0.279755 0.269220 0.248439 0.225461 0.225429 0.248066 0.225813 0.225884
chargesum: 0.00000
title: Mulliken charges with hydrogens summed into heavy atoms:
elementType: S O O N C C C C C C C C C
charge: 0.128561 -0.270394 -0.271826 0.299350 0.420891 0.397559 -0.247456 0.565033 -0.275966 -0.290535 0.164353 0.164700 -0.784269
polarizability: 2.42496113e+02 1.03081174e+00 1.36915495e+02 -8.02072030e-02 -6.39911669e-03 5.88832836e+01
1716.lowfreq: -7.0582 -6.8497 -5.8706 -0.0023 -0.0016 -0.0014 20.8831 52.3853 90.4732
frequency: 20.8765 52.3782 90.4653 102.4620 167.2454 191.9541 198.5861 229.1145 252.6074 259.2546 268.7868 313.9233 355.8959 412.8402 418.2803 423.9621 490.1642 519.9128 599.2898 605.7403 609.4117 681.7423 749.6766 824.0308 843.4160 870.3492 881.4969 960.6031 977.6951 1039.1916 1043.2406 1110.6985 1112.0325 1140.9475 1152.7509 1165.2234 1174.9166 1260.3782 1322.0844 1401.0389 1422.5708 1439.1018 1451.5027 1456.3847 1466.1121 1466.7773 1472.7936 1475.8640 1593.7479 1605.6865 2199.7698 2966.0861 2966.2295 3057.6260 3057.8413 3128.4775 3129.5692 3183.3649 3185.1892 3187.7823
redmass: 8.9757 5.7561 3.3331 3.6977 3.5755 1.6100 1.5228 3.9793 4.1285 2.0218 2.1805 7.4586 6.2538 8.4903 5.8343 11.8578 6.2236 5.3917 4.2218 4.5618 4.0584 1.7227 11.0510 1.5010 1.5435 1.9297 7.2743 8.4122 6.3647 2.9426 2.4471 1.2586 1.2582 1.6140 1.3665 1.8228 2.2239 1.2472 6.5719 7.4457 1.4766 1.4055 2.0652 1.9517 1.0501 1.0501 1.0829 1.2866 6.1626 7.0099 12.8835 1.0324 1.0325 1.1044 1.1045 1.1000 1.1000 1.0920 1.0914 1.0936
irintensity: 0.0675 1.0187 8.6478 2.3869 4.3219 0.7354 1.8127 2.2658 0.9138 0.2231 0.5715 4.0192 0.7396 0.9860 1.5590 0.3539 4.2729 11.1405 0.0267 0.0642 0.7307 25.8721 92.9370 3.2305 15.1608 84.5752 14.5204 32.3794 10.0139 64.3293 45.2002 0.1139 0.2019 110.3279 0.3694 149.0796 48.6817 1.8806 72.4855 21.7705 45.6287 1.9300 54.9141 60.1791 12.9759 15.3273 15.8139 32.2131 297.4286 304.9789 1338.2671 71.7616 40.8688 7.5672 80.5397 23.0255 21.9000 1.2475 0.8841 0.2409
temp: 298.150 k
press: 1.00000 atm
elementType: 16 8 8 7 6 6 6 6 6 6 6 6 6 1 1 1 1 1 1 1 1 1
symmnumber: 1
zpe: 425913.3 jmol-1
zpe.correction: 0.162222 hartree
zpe.thermalcorrener: 0.175324 hartree
zpe.thermalcorrenthalpy: 0.176268 hartree
zpe.thermalcorrgfe: 0.120972 hartree
zpe.sumelectzpe: -950.642330 hartree
zpe.sumelectthermal: -950.629228 hartree
zpe.sumelectthermalent: -950.628283 hartree
zpe.sumelectthermalfe: -950.683580 hartree
dipole: 4.4690 1.9387 0.0109
dipole: 4.8714
quadrupole: -88.0126 -71.4223 -85.6081
quadrupole: -6.6948 0.0374 0.0080
quadrupole: -6.3316 10.2587 -3.9271 -6.6948 0.0374 0.0080
hfenergy: -950.8045519 hartree
pointgroup: C01 [X(C9H9N1O2S1)]
dipole: 1.6165371 1.0247563 0.0993222 debye
dipolederiv: -1.3771883 -0.3029439 -0.0746272 -0.2861225 -0.143225 -0.0164517 -0.0729505 -0.0170108 -0.0833728 -1.3858179 0.5595501 -0.0640483 0.8002721 -0.7833407 0.0471741 -0.0640883 0.0328032 -0.3057706 -0.3974363 -0.2101598 -0.0057683 -0.2298364 -1.7039784 -0.015137 -0.0053622 -0.0133339 -0.3016285 -2.5311897 -0.5705092 -0.144193 -0.563903 -0.2810411 -0.0324085 -0.1407473 -0.0320813 -0.0249341 1.1431334 -0.4977153 0.0595347 -0.8521526 0.9273099 -0.0504202 0.0597924 -0.0292711 0.131954 0.5128853 0.541654 0.0229464 0.2909647 1.5025771 0.0180011 0.0224918 0.0320845 0.1401539 -0.2559933 0.0695025 -0.0003605 0.1776972 -0.6822869 0.0102084 -0.0007295 0.0033483 -0.2484012 1.5485958 0.2414829 0.0840145 0.1743737 0.6941072 0.0105208 0.0835673 0.0144504 0.122755 -0.7631906 0.1893323 -0.0314258 0.1080833 -0.225198 0.0064906 -0.0322902 0.0112061 -0.2276932 -0.5536555 -0.4074064 -0.0171473 -0.1233454 -0.469023 -0.0071369 -0.0173909 -0.0236104 -0.26745 0.8909678 -0.2372078 0.0337769 0.07619 0.1882664 0.0044609 0.0343297 -0.0143589 0.324092 0.2167711 -0.399998 -0.0066357 -0.0075191 0.7549144 0.0004036 -0.0060653 -0.0219912 0.3209049 2.9053849 0.6900114 0.169066 0.6705635 0.1023902 0.03812 0.1658909 0.0384515 -0.0604164 -0.0339908 -0.0249117 -0.0127453 -0.0352193 0.1139194 -0.0021175 -0.0127467 -0.0014503 0.1821287 0.0994645 -0.0337426 -0.0055559 -0.04828 0.0025905 -0.0029196 -0.0058161 -0.0019908 0.1926698 0.0422775 0.0845463 -0.0085418 0.0774825 0.0238166 0.0043144 -0.0086281 0.0046693 0.1889508 0.0008634 0.0822574 -0.0074327 0.1442118 -0.0783879 0.008692 -0.0074856 0.0050307 0.1242262 -0.0420836 0.0329663 -0.016534 -0.1292099 0.0526755 -0.126492 -0.0651534 -0.0773173 -0.0886197 -0.0528053 0.0232607 0.0213305 -0.1437144 0.0525576 0.1101376 0.0695566 0.0808736 -0.0779888 0.0281914 -0.1207851 -0.0057297 -0.0799213 -0.1065118 -0.0050579 -0.0056949 -0.0074126 0.1240977 0.0143461 0.1444945 -0.1063329 -0.0075727 0.0289936 -0.0429625 -0.0967151 0.029556 -0.0948817 -0.0095296 0.1463214 0.1164092 -0.0130421 0.0288744 0.0425803 0.1062354 -0.0126451 -0.070776 unknown
polarizability: 239.0644798|17.038625|139.7406296|10.453855|1.0241391|59.4897817 unknown
InChI: InChI=1S/C9H9NO2S/c1-11-8-3-7(10-6-13)4-9(5-8)12-2/h3-5H,1-2H3
charge 0 multiplicity 1
22 atoms
S  -5.088006 -1.242784 -0.275262
O  2.213064 -2.129657 0.147814
O  1.32297 2.641662 0.097498
N  -2.32441 -0.622114 -0.119995
C  1.347909 -1.031331 0.096828
C  0.797673 1.343464 0.065874
C  1.772286 0.313717 0.122425
C  -0.976867 -0.319629 -0.039854
C  -0.027795 -1.362684 0.01547
C  -0.579033 1.049326 -0.015062
C  3.651909 -1.856791 0.235959
C  0.374678 3.760024 0.047186
C  -3.499181 -0.885685 -0.186169
H  2.823388 0.604008 0.18422
H  -0.333741 -2.410988 -0.003069
H  -1.344886 1.826289 -0.058956
H  4.128143 -2.847521 0.264986
H  3.896663 -1.296402 1.158448
H  4.00742 -1.296214 -0.649613
H  0.998589 4.664775 0.08478
H  -0.209221 3.747543 -0.892918
H  -0.310653 3.74209 0.91601
