program: Gaussian 09
title: 000145383
version: EM64L-G09RevD.01
frameworkgroup: C1[X(C8H10)]
method: RPBEPBE
basis: SDD
operation: Freq
keyword: #p
keyword: freq=noraman
keyword: PBEPBE/SDD
title: #p freq=noraman PBEPBE/SDD
converged: YES YES YES YES
title: Mulliken charges:
elementType: C C C C C C C C H H H H H H H H H H
charge: -0.298880 -0.298897 -0.131328 -0.131328 -0.434564 -0.434564 -0.191413 -0.191414 0.242187 0.242197 0.218872 0.218872 0.204767 0.204788 0.204786 0.204769 0.185575 0.185576
chargesum: 0.00000
title: Mulliken charges with hydrogens summed into heavy atoms:
elementType: C C C C C C C C
charge: -0.056693 -0.056700 0.087544 0.087544 -0.025009 -0.025009 -0.005838 -0.005839
polarizability: 7.69346590e+01 -4.94312407e-05 9.21850623e+01 2.44180451e-03 -9.36755849e-05 6.13739044e+01
1716.lowfreq: -5.1726 -0.0003 -0.0002 0.0005 12.4030 24.1470 104.2461 253.5690 355.8295
frequency: 104.2414 253.5616 355.8295 370.8426 403.7176 407.1079 585.1627 667.8709 714.6744 716.5537 777.4459 808.3427 823.7350 857.6988 920.2762 930.8224 949.3650 980.4693 984.2863 998.9147 1006.1544 1019.9318 1139.1790 1142.0461 1173.0350 1218.3128 1222.9724 1241.7344 1245.2135 1319.8358 1360.9593 1376.8009 1385.0213 1421.6710 1444.4679 1448.7547 1456.0135 1714.9858 2930.6582 2930.7591 2965.6072 2967.8222 3030.9121 3033.9958 3054.4148 3089.0406 3179.9802 3197.9621
redmass: 2.0519 2.2495 6.9672 2.1208 2.0689 6.7266 3.7521 1.2963 1.4033 2.2216 2.6173 2.8508 2.7886 5.2930 3.9252 1.3317 1.6757 1.2167 3.2889 1.6877 1.2772 1.6804 1.1966 1.4337 1.3517 1.4601 1.1220 1.1198 1.2012 1.6391 3.5585 1.4599 1.7671 1.5378 1.1323 1.0902 1.8395 7.1429 1.0595 1.0594 1.0974 1.0969 1.0844 1.0858 1.0819 1.0956 1.0909 1.1031
irintensity: 0.5249 0.0000 1.1602 0.0000 12.2327 0.0820 9.9058 11.1216 4.2123 105.9643 7.1046 0.5246 0.0000 1.0713 1.2756 0.0000 0.2401 0.0000 0.0139 0.0000 5.8754 9.0184 1.2188 23.8228 0.0000 2.1755 0.0000 0.6154 0.0004 1.8736 1.4662 0.0274 0.6547 4.1327 0.7569 16.9466 12.4997 5.4856 86.0631 4.9900 0.0001 53.6991 72.1387 31.3977 14.9844 76.0931 8.7046 11.2974
temp: 298.150 k
press: 1.00000 atm
elementType: 6 6 6 6 6 6 6 6 1 1 1 1 1 1 1 1 1 1
symmnumber: 1
zpe: 402717.8 jmol-1
zpe.correction: 0.153387 hartree
zpe.thermalcorrener: 0.160045 hartree
zpe.thermalcorrenthalpy: 0.160989 hartree
zpe.thermalcorrgfe: 0.122864 hartree
zpe.sumelectzpe: -310.138283 hartree
zpe.sumelectthermal: -310.131625 hartree
zpe.sumelectthermalent: -310.130681 hartree
zpe.sumelectthermalfe: -310.168806 hartree
dipole: -0.8263 0.0000 -0.0002
dipole: 0.8263
quadrupole: -44.5867 -43.6248 -51.3576
quadrupole: 0.0000 -0.0002 0.0000
quadrupole: 1.9364 2.8982 -4.8346 0.0000 -0.0002 0.0000
hfenergy: -310.29167 hartree
pointgroup: C01 [X(C8H10)]
dipole: -0.3251056 0.0000008 0.0000064 debye
dipolederiv: -0.1505043 0.0000065 -0.0496779 0.0000049 -0.0529159 0.0000047 -0.0698618 -0.0000048 -0.339009 -0.1504534 -0.0000056 0.0495619 -0.0000042 -0.0529665 0.0000049 0.0697299 -0.0000049 -0.3391375 0.3164515 0.048304 -0.0000741 0.1143565 0.1936497 -0.0000213 -0.0000807 -0.0000318 0.1421791 0.316452 -0.0483054 -0.0000616 -0.1143574 0.1936508 0.000013 -0.0000688 0.000024 0.1421796 -0.0290564 0.0044233 0.0000247 0.0167997 -0.0312362 0.0000546 0.0000392 0.0001787 0.2104469 -0.0290578 -0.004422 0.0000191 -0.0167991 -0.0312356 -0.0000293 0.0000286 -0.0001288 0.2104472 0.1665411 -0.1383758 0.0000307 -0.0813342 0.0957885 -0.0000376 0.0000002 -0.0001172 -0.2421925 0.1665404 0.1383762 0.0000198 0.0813349 0.0957877 0.0000173 -0.0000026 0.0000842 -0.242193 -0.0274488 0.0000013 0.1469792 0.0000011 0.0237503 -0.0000004 0.0965641 -0.0000007 0.0511673 -0.0276182 -0.0000012 -0.1469278 -0.000001 0.0237455 -0.0000004 -0.0965048 -0.0000009 0.0513558 -0.0875403 0.1219161 0.0000703 0.0891855 -0.1282542 -0.0000288 0.0000759 -0.0000351 0.1420913 -0.0875402 -0.121916 0.0000679 -0.0891857 -0.1282544 0.0000311 0.0000741 0.0000413 0.1420912 -0.0018629 0.0163641 -0.0234165 -0.0199544 -0.0481263 -0.105799 -0.0329626 -0.1765956 -0.0544844 -0.0018167 0.0165261 0.0233721 -0.0198616 -0.0479356 0.1057582 0.0329584 0.1765624 -0.0546914 -0.0018212 -0.0165123 0.0233798 0.0198711 -0.0479652 -0.1057661 0.032959 -0.176569 -0.0546634 -0.0018579 -0.0163792 -0.023408 0.0199442 -0.0480976 0.1057917 -0.0329611 0.1765897 -0.0545127 -0.1847038 -0.0794334 0.0000228 -0.0818406 -0.0046927 0.0000025 0.0000083 -0.0000025 0.1444628 -0.1847031 0.0794332 0.0000177 0.0818402 -0.0046923 0.0000049 0.0000048 0.0000112 0.144463 unknown
polarizability: 76.9346593|-0.000008|92.1850623|-0.0010745|-0.0008275|61.3739041 unknown
InChI: InChI=1S/C8H10/c1-2-4-6-7-5(3-1)8(6)7/h1-2,5-8H,3-4H2
charge 0 multiplicity 1
18 atoms
C  -1.456925 0.00001 0.784985
C  -1.457503 0.000002 -0.784283
C  -0.88188 1.182609 0.000137
C  -0.88188 -1.182596 0.000147
C  0.566827 1.666491 -0.000452
C  0.566827 -1.66648 -0.000361
C  1.710229 0.679014 -0.000367
C  1.71023 -0.679005 -0.000335
H  -2.322382 0.000017 1.448561
H  -2.323451 -0.000004 -1.447217
H  -1.563683 2.051643 0.000377
H  -1.563683 -2.05163 0.000388
H  0.69541 2.333659 0.881077
H  0.694912 2.332958 -0.882589
H  0.694947 -2.333045 -0.882418
H  0.69537 -2.333552 0.881248
H  2.699467 1.165407 -0.000378
H  2.699468 -1.165398 -0.000321
