program: Gaussian 09
title: 000145382
version: EM64L-G09RevD.01
frameworkgroup: C1[X(C10H10ClF13Si)]
method: RPBEPBE
basis: SDD
operation: Freq
keyword: #p
keyword: freq=noraman
keyword: PBEPBE/SDD
title: #p freq=noraman PBEPBE/SDD
converged: YES YES NO NO
title: Mulliken charges:
elementType: Cl Si F F F F F F F F F F F F F C C C C C C C C C C H H H H H H H H H H
charge: -0.315822 1.064797 -0.159788 -0.160655 -0.126623 -0.136489 -0.137850 -0.123699 -0.118607 -0.132653 -0.125255 -0.114311 -0.123828 -0.120635 -0.123627 0.310357 -0.460776 0.213390 -0.797405 0.249252 0.249105 0.207212 -0.994909 -0.997182 0.373120 0.255141 0.264517 0.277351 0.281150 0.261131 0.265318 0.235739 0.260255 0.236117 0.266159
chargesum: 0.00000
title: Mulliken charges with hydrogens summed into heavy atoms:
elementType: Cl Si F F F F F F F F F F F F F C C C C C C C C C C
charge: -0.315822 1.064797 -0.159788 -0.160655 -0.126623 -0.136489 -0.137850 -0.123699 -0.118607 -0.132653 -0.125255 -0.114311 -0.123828 -0.120635 -0.123627 0.310357 0.058883 0.213390 -0.238904 0.249252 0.249105 0.207212 -0.232720 -0.234651 0.373120
polarizability: 1.72859193e+02 -1.03468370e+00 1.34100008e+02 -4.38126737e+00 2.78105851e-01 1.35042106e+02
1716.lowfreq: -5.1712 0.0007 0.0010 0.0016 2.1982 3.3354 16.4119 20.6509 27.4947
frequency: 16.1075 20.1127 27.4604 35.9201 44.7395 53.9326 67.7294 86.2969 98.5377 109.6226 112.8691 129.5873 133.7428 142.1610 143.1024 149.3137 161.9441 171.4383 190.4493 195.8242 213.4811 225.6825 239.0273 248.2241 249.6156 257.9188 264.6478 283.5235 284.5458 298.2227 303.5636 313.1310 326.4380 327.3582 336.0218 381.2597 408.8303 421.6399 433.4312 445.0024 463.0427 508.8704 521.6324 552.3907 562.4371 583.4616 587.6803 612.0677 654.0551 685.0346 700.2452 729.0239 774.5428 805.8255 816.0550 819.1780 874.4330 884.8737 900.0431 920.3926 936.9090 972.0478 996.1743 1006.4585 1021.5641 1026.3986 1036.4765 1039.1453 1051.8342 1077.0387 1081.9804 1115.4029 1132.7045 1144.1371 1155.6413 1167.3376 1187.8855 1196.8380 1242.5392 1306.7547 1316.1448 1317.3892 1356.6690 1433.5851 1438.0393 1443.2235 1445.3323 1455.7958 1459.0269 2986.1160 2987.3012 3010.2786 3018.3183 3067.0262 3086.0568 3086.9627 3087.6946 3104.4130 3104.9508
redmass: 9.3353 4.5680 13.8471 13.6051 5.0975 7.5295 11.3723 9.2379 3.9392 16.2199 9.1322 1.0711 9.2087 6.3198 1.0665 7.7988 3.1692 10.9545 3.3153 13.6922 14.4234 2.5375 15.6028 14.3477 5.6180 8.8080 11.3001 16.0103 17.5174 17.9220 17.1615 12.9747 6.4251 12.3394 9.5571 7.7041 10.4720 11.8886 10.3204 11.5335 17.6174 12.6518 12.3242 15.2237 15.4437 16.1318 17.2563 4.7725 16.5014 5.9418 1.7377 1.5994 3.7248 1.3309 1.6314 9.4268 7.1461 1.5838 2.6604 1.5425 8.9556 12.3700 8.1668 3.9411 3.9432 7.0722 12.1374 7.7901 6.5430 12.5224 12.5082 11.6760 10.6101 9.6841 11.0371 5.8357 11.8554 1.3741 1.3824 1.1911 1.1443 1.1882 1.3730 1.0509 1.0683 1.0468 1.0531 1.0882 1.0647 1.0357 1.0355 1.0602 1.0582 1.1013 1.0969 1.1020 1.0968 1.0989 1.0987
irintensity: 0.1395 1.2349 0.1113 0.4246 1.3916 0.9982 0.8503 1.1124 1.2003 0.2909 0.2483 0.0108 0.7489 0.6457 0.0819 1.0651 1.7547 0.2693 4.1953 10.5609 12.0496 4.3650 1.6675 0.2374 8.2216 3.0109 0.8600 1.8402 1.9162 0.1633 0.0934 2.7636 3.4183 0.2037 0.2796 4.4711 6.6155 2.0336 41.4642 15.5123 9.1811 3.9880 3.9281 3.8337 8.8760 4.8921 1.5769 5.6268 46.5447 21.2244 0.6212 7.7419 33.9988 0.6568 44.5982 199.4152 56.3933 115.9253 139.9798 81.4230 167.3272 15.5196 48.2372 102.0407 19.7430 97.0998 87.5395 27.5597 36.3693 219.9934 351.2918 30.0000 83.0982 17.1682 3.9791 20.1173 49.7767 32.9794 55.6381 32.3756 19.3484 23.9910 14.6705 0.5085 2.9116 10.5865 3.5280 26.5141 11.4228 4.3335 7.5250 1.9183 9.1043 0.3390 2.8837 3.5158 19.4242 3.6303 9.4011
temp: 298.150 k
press: 1.00000 atm
elementType: 17 14 9 9 9 9 9 9 9 9 9 9 9 9 9 6 6 6 6 6 6 6 6 6 6 1 1 1 1 1 1 1 1 1 1
symmnumber: 1
zpe: 522812.0 jmol-1
zpe.correction: 0.199129 hartree
zpe.thermalcorrener: 0.227957 hartree
zpe.thermalcorrenthalpy: 0.228901 hartree
zpe.thermalcorrgfe: 0.137223 hartree
zpe.sumelectzpe: -2432.520928 hartree
zpe.sumelectthermal: -2432.492100 hartree
zpe.sumelectthermalent: -2432.491155 hartree
zpe.sumelectthermalfe: -2432.582833 hartree
dipole: 0.5588 -0.7996 3.2427
dipole: 3.3863
quadrupole: -174.4002 -161.7412 -162.3355
quadrupole: 1.9717 15.0875 -0.1660
quadrupole: -8.2412 4.4178 3.8234 1.9717 15.0875 -0.1660
hfenergy: -2432.7200562 hartree
pointgroup: C01 [X(C10H10Cl1F13Si1)]
dipole: -0.2585287 0.3334292 1.263688 debye
polarizability: 172.4588206|-1.6483326|134.1399095|5.7006567|-0.4018932|135.4025767 unknown
InChI: InChI=1S/C10H10ClF13Si/c1-25(2,11)4-3-5(12,13)6(14,15)7(16,17)8(18,19)9(20,21)10(22,23)24/h3-4H2,1-2H3
charge 0 multiplicity 1
35 atoms
Cl -6.617636 0.755338 -1.462755
Si -5.036544 0.566181 0.088216
F  -0.703766 -0.152656 -1.7140
F  -1.559398 -2.242062 -1.38184
F  1.088586 -2.018138 -0.740523
F  -0.308049 -2.548065 0.991334
F  -0.118111 -0.084875 2.081936
F  1.874037 -1.151602 1.744603
F  1.919666 1.58041 1.697194
F  0.372545 1.664544 0.025895
F  2.901542 2.283358 -0.718045
F  2.115944 0.396074 -1.735453
F  4.425663 0.543696 1.085717
F  4.912648 0.572837 -1.129194
F  3.817107 -1.19771 -0.242156
C  -1.153329 -1.053638 -0.695949
C  -2.327572 -0.461495 0.078219
C  0.110279 -1.491451 0.132663
C  -3.555848 -0.225375 -0.835177
C  0.829035 -0.460398 1.087306
C  1.438473 0.89405 0.555956
C  2.596859 0.915563 -0.517477
C  -4.6571 2.32491 0.694369
C  -5.738808 -0.561671 1.444321
C  3.956296 0.191452 -0.183582
H  -1.991173 0.487159 0.533507
H  -2.572512 -1.158486 0.901143
H  -3.282966 0.436433 -1.678235
H  -3.892975 -1.180203 -1.278089
H  -4.284569 2.95441 -0.132538
H  -5.569043 2.799839 1.096677
H  -3.895988 2.317722 1.497672
H  -5.960117 -1.56723 1.046042
H  -5.028667 -0.667731 2.286378
H  -6.678307 -0.142288 1.845066
