program: Gaussian 09
title: 000145370
version: EM64L-G09RevD.01
frameworkgroup: C1[X(C11H18O)]
method: RPBEPBE
basis: SDD
operation: Freq
keyword: #pfreq=noraman
keyword: PBEPBE/SDD
title: #p freq=noraman PBEPBE/SDD
converged: NO YES NO NO
title: Mulliken charges:
elementType: O C C C C C C C C C C C H H H H H H H H H H H H H H H H H H
charge: -0.293392 -0.147242 0.298949 -0.424594 -0.444642 -0.577336 -0.408473 -0.394842 -0.430730 -0.488853 0.079754 -0.519795 0.204993 0.194244 0.198763 0.207827 0.192014 0.253204 0.200379 0.203859 0.189822 0.199044 0.199486 0.209429 0.201627 0.223239 0.211854 0.215642 0.212453 0.233316
chargesum: 0.00000
title: Mulliken charges with hydrogens summed into heavy atoms:
elementType: O C C C C C C C C C C C
charge: -0.293392 0.057751 0.298949 -0.031586 -0.044801 -0.123753 -0.014791 0.003688 -0.019675 -0.053760 0.079754 0.141616
polarizability: 1.45704724e+02 5.55810719e-01 1.18995219e+02 -4.00732928e+00 2.34176162e-01 9.04848106e+01
1716.lowfreq: -13.7749 -11.3696 -0.0007 -0.0005 0.0008 26.4402 55.6580 95.7992 107.5364
frequency: 55.2439 95.6988 107.5163 138.5273 190.0801 209.0819 249.9993 271.3567 312.0866 329.4302 389.6914 413.9717 425.4677 442.5122 478.5944 529.2561 564.2366 613.1519 682.6965 795.7930 827.7469 839.3322 852.8628 868.6509 902.7875 907.8539 935.8552 976.3412 1002.4421 1015.1779 1044.7555 1074.0007 1088.3063 1100.2213 1106.8851 1108.7608 1126.2858 1131.8103 1148.6244 1153.7717 1174.4834 1186.6514 1236.6128 1243.1755 1258.7359 1263.3229 1277.1466 1318.0960 1320.2753 1329.2413 1334.2539 1340.4640 1344.8155 1349.2994 1350.1815 1433.8662 1453.6395 1455.8523 1459.5225 1464.8030 1465.2570 1467.1449 1470.4755 1472.1222 1474.8302 1688.1805 2902.1764 2940.9805 2948.1720 2954.1566 2957.7083 2962.3965 2966.5213 2971.1157 2980.4907 3008.7428 3017.6160 3024.7159 3029.4496 3035.3137 3037.0183 3044.2210 3066.7419 3106.5422
redmass: 2.6411 2.6332 2.3394 2.0537 1.3092 3.2211 2.1768 2.0969 2.6628 1.8150 3.3141 3.7547 3.4627 3.1934 2.7265 2.0658 2.2829 3.5992 2.9893 2.0836 1.8746 1.8032 2.2057 1.6023 2.1940 1.6791 2.9823 2.7991 1.7840 2.1126 2.2333 1.5976 1.6759 1.7697 1.3362 1.6715 2.0208 1.4941 1.6101 1.9922 1.9626 1.4875 1.3844 1.3456 1.2135 1.5276 1.2160 1.4335 1.4755 1.4501 1.4362 1.5191 1.5511 1.7524 1.5424 1.1435 1.0873 1.0850 1.0881 1.0816 1.0673 1.0846 1.0849 1.0802 1.0678 8.5565 1.0811 1.0692 1.0434 1.0508 1.0595 1.0631 1.0616 1.0617 1.0638 1.0949 1.0990 1.0989 1.0985 1.1031 1.1031 1.1039 1.0910 1.0993
irintensity: 5.8080 2.7604 0.4985 0.6793 1.0279 6.3493 3.4199 0.9955 0.9134 1.8773 1.6592 1.8534 1.3134 3.2046 0.6586 0.1988 0.8035 10.0230 0.6503 2.2876 10.5477 5.8519 6.3465 0.9305 2.4925 6.7250 5.6428 24.3317 21.1810 13.5335 3.5972 18.7594 10.6978 9.8254 1.6266 0.6383 46.4006 5.8742 25.3427 0.5419 59.1293 2.1213 1.1742 3.1623 3.8445 6.9640 2.3489 0.6486 2.6117 8.6005 0.1414 2.7792 1.1011 9.6666 9.4630 1.1225 6.3828 2.7958 10.7069 7.8858 10.7863 19.2256 6.3791 5.9384 13.2464 28.1150 30.4464 40.9639 10.1577 123.4305 22.0421 32.5375 63.7462 45.1926 32.5965 32.8190 47.6245 50.0732 84.6337 52.2296 94.0626 75.9717 19.3608 29.3966
temp: 298.150 k
press: 1.00000 atm
elementType: 8 6 6 6 6 6 6 6 6 6 6 6 1 1 1 1 1 1 1 1 1 1 1 1 1 1 1 1 1 1
symmnumber: 1
zpe: 700374.0 jmol-1
zpe.correction: 0.266758 hartree
zpe.thermalcorrener: 0.278558 hartree
zpe.thermalcorrenthalpy: 0.279503 hartree
zpe.thermalcorrgfe: 0.229366 hartree
zpe.sumelectzpe: -504.217078 hartree
zpe.sumelectthermal: -504.205278 hartree
zpe.sumelectthermalent: -504.204333 hartree
zpe.sumelectthermalfe: -504.254470 hartree
dipole: -0.6727 0.9059 1.2068
dipole: 1.6521
quadrupole: -68.5240 -73.5559 -74.3953
quadrupole: 0.2517 -4.1174 -2.4008
quadrupole: 3.6344 -1.3975 -2.2369 0.2517 -4.1174 -2.4008
hfenergy: -504.483836 hartree
pointgroup: C01 [X(C11H18O1)]
dipole: -0.273989 -0.3430226 -0.4793431 debye
polarizability: 145.1400179|-2.4289626|119.2126952|5.9106442|-0.5710997|90.8320398 unknown
InChI: InChI=1S/C11H18O/c1-12-11-8-4-6-9-5-2-3-7-10(9)11/h9H,2-8H2,1H3
charge 0 multiplicity 1
30 atoms
O  -1.862538 1.55928 0.197054
C  0.921331 -1.068044 0.265931
C  0.148402 0.252765 0.293229
C  2.232559 -0.912714 -0.560378
C  0.075304 -2.249549 -0.266214
C  0.956799 1.489363 0.650427
C  3.081718 0.293298 -0.102076
C  2.260039 1.599925 -0.1835
C  -1.364114 -2.211857 0.286008
C  -2.077112 -0.917834 -0.17046
C  -1.197457 0.29914 0.070797
C  -2.862608 1.861536 -0.835371
H  1.227475 -1.298731 1.313472
H  1.962349 -0.779528 -1.628833
H  2.818877 -1.850923 -0.489322
H  0.569385 -3.205817 -0.005997
H  0.037317 -2.198878 -1.37439
H  0.332663 2.390845 0.532051
H  1.240093 1.43365 1.724754
H  3.996995 0.371304 -0.720842
H  3.414263 0.134493 0.945255
H  2.001347 1.801771 -1.242903
H  2.861557 2.458507 0.173928
H  -1.334864 -2.239754 1.393235
H  -1.937338 -3.097201 -0.049624
H  -3.024466 -0.793192 0.392064
H  -2.352964 -1.005044 -1.242501
H  -3.693891 1.129636 -0.837929
H  -2.401158 1.894284 -1.842725
H  -3.258862 2.856065 -0.57724
