program: Gaussian 09
title: 000145367
version: EM64L-G09RevD.01
frameworkgroup: C1[X(C8H16N4O2)]
method: RPBEPBE
basis: SDD
operation: Freq
keyword: #p
keyword: freq=noraman
keyword: PBEPBE/SDD
title: #p freq=noraman PBEPBE/SDD
converged: YES YES NO NO
title: Mulliken charges:
elementType: O O N N N N C C C C C C C C H H H H H H H H H H H H H H H H
charge: -0.305306 -0.305308 -0.137367 -0.146104 -0.146167 -0.137284 -0.408905 -0.408929 0.285254 0.285283 -0.611963 -0.625438 -0.625473 -0.611945 0.255864 0.241383 0.241391 0.255878 0.218408 0.234543 0.277254 0.278126 0.222696 0.221540 0.278166 0.222688 0.221544 0.218414 0.234541 0.277217
chargesum: 0.00000
title: Mulliken charges with hydrogens summed into heavy atoms:
elementType: O O N N N N C C C C C C C C
charge: -0.305306 -0.305308 -0.137367 -0.146104 -0.146167 -0.137284 0.088341 0.088339 0.285254 0.285283 0.118242 0.096925 0.096925 0.118226
polarizability: 1.38311251e+02 9.50560435e+00 1.18973249e+02 4.32208404e-03 -1.31690702e-04 9.77700085e+01
1716.lowfreq: -13.6111 -0.0004 0.0002 0.0006 8.5703 16.6330 65.0693 80.3959 98.8520
frequency: 65.0686 80.3911 98.8182 102.1730 107.2313 113.5523 120.2986 128.2110 132.0595 180.9115 251.4264 265.8846 291.4896 299.0101 334.0741 373.6161 377.8866 393.2169 408.5790 437.6806 514.7904 538.4871 573.6824 631.9424 709.2929 715.8825 745.2932 770.0424 893.0742 915.7117 982.1882 994.3746 1018.4226 1037.4176 1052.8073 1113.3832 1121.5779 1121.5934 1128.1662 1131.9513 1157.2096 1189.7879 1211.2350 1238.1865 1244.2895 1246.1138 1281.4418 1313.3616 1350.2963 1384.6139 1405.8437 1406.9844 1415.6613 1416.0035 1432.3384 1451.7746 1465.4444 1474.3690 1479.8406 1482.9434 1484.7539 1486.2039 1487.4763 1494.7216 1500.6949 1507.3641 1585.0675 1597.7313 2959.1043 2959.1588 2965.6344 2966.1757 2985.9325 2990.0498 3037.0459 3037.8415 3039.5713 3041.2787 3041.6717 3048.3244 3120.0768 3120.1419 3121.4314 3121.5460
redmass: 3.1662 5.9007 1.7228 1.8685 2.4834 1.4416 1.1258 1.3170 1.4033 3.0260 3.0254 3.9702 3.0395 4.7820 2.9925 3.8887 6.9890 2.1908 5.0149 2.8378 5.4599 2.5591 4.7418 5.5076 8.3977 8.1652 5.2120 6.3850 3.7286 3.5790 2.1136 1.7340 1.8846 1.8372 2.2293 2.1156 1.3059 1.3010 1.2856 1.4400 2.1724 2.9719 2.6363 2.1781 4.3797 2.3627 2.3907 1.6904 1.7969 1.4797 1.5713 1.2309 1.2212 1.2008 1.3148 1.3193 1.0621 1.0659 1.0610 1.0540 1.0605 1.0704 1.0604 1.2119 1.3387 1.0956 6.5373 6.9854 1.0392 1.0392 1.0363 1.0368 1.0604 1.0638 1.0998 1.0989 1.1028 1.1024 1.1018 1.1001 1.0966 1.0966 1.0962 1.0962
irintensity: 0.0025 0.9539 3.5215 3.6438 5.2621 0.4674 0.0422 1.6115 1.8109 3.2909 6.6396 14.3097 2.7628 1.9314 3.5928 5.5580 0.1579 11.1079 10.7440 6.1448 8.9435 0.6294 3.3229 37.6677 0.5302 17.8450 21.8429 14.4270 37.6403 4.6720 2.2108 36.0075 10.1912 85.8346 0.0606 82.2168 0.8930 10.8760 0.2617 27.1631 111.7588 20.9506 55.3003 2.8477 71.6997 27.8414 12.1107 95.9605 15.0179 55.5944 138.3793 2.6723 117.7123 42.9271 221.5439 56.7921 20.3569 3.5890 10.1501 19.0480 19.9036 6.1931 44.9864 5.2010 184.7926 12.1873 450.8323 137.6749 8.0569 119.6632 105.4259 19.7281 76.7742 38.0655 16.2835 76.2129 20.8829 48.3087 21.2265 24.2977 1.1659 0.9503 3.8166 0.3817
temp: 298.150 k
press: 1.00000 atm
elementType: 8 8 7 7 7 7 6 6 6 6 6 6 6 6 1 1 1 1 1 1 1 1 1 1 1 1 1 1 1 1
symmnumber: 1
zpe: 658056.2 jmol-1
zpe.correction: 0.250640 hartree
zpe.thermalcorrener: 0.266087 hartree
zpe.thermalcorrenthalpy: 0.267031 hartree
zpe.thermalcorrgfe: 0.208510 hartree
zpe.sumelectzpe: -682.794099 hartree
zpe.sumelectthermal: -682.778652 hartree
zpe.sumelectthermalent: -682.777708 hartree
zpe.sumelectthermalfe: -682.836229 hartree
dipole: 0.0002 -0.0009 -3.4986
dipole: 3.4986
quadrupole: -96.5672 -79.6885 -82.7417
quadrupole: 17.1080 -0.0043 0.0012
quadrupole: -10.2347 6.6439 3.5907 17.1080 -0.0043 0.0012
hfenergy: -683.0447389 hartree
pointgroup: C01 [X(C8H16N4O2)]
dipole: -0.0001549 0.0003393 -1.376439 debye
polarizability: 134.7073081|12.1268775|122.5771914|-0.004285|-0.0005804|97.7700085 unknown
InChI: InChI=1S/C8H16N4O2/c1-9-5-10(2)8(14)12(4)6-11(3)7(9)13/h5-6H2,1-4H3
charge 0 multiplicity 1
30 atoms
O  -2.73983 0.832534 0.850216
O  2.740295 -0.833039 0.849165
N  -0.568711 1.35108 0.144779
N  -1.668423 -0.611203 -0.658988
N  1.668349 0.611312 -0.659061
N  0.568724 -1.350995 0.144678
C  0.403098 1.358114 -0.940158
C  -0.403101 -1.357832 -0.94025
C  -1.718331 0.540128 0.150843
C  1.718168 -0.539808 0.151056
C  -0.383534 2.325776 1.233498
C  -2.926945 -1.350272 -0.869668
C  2.926991 1.350082 -0.8701
C  0.383866 -2.326303 1.232898
H  -0.09147 1.003455 -1.861031
H  0.715064 2.40475 -1.122824
H  -0.714957 -2.404467 -1.123137
H  0.09139 -1.002929 -1.861073
H  -0.383342 3.361828 0.842046
H  0.568983 2.140792 1.765772
H  -1.224677 2.221535 1.93509
H  -3.763797 -0.706304 -0.561248
H  -2.964184 -2.274663 -0.258238
H  -3.044264 -1.622581 -1.93513
H  3.763778 0.706031 -0.561669
H  2.964502 2.274587 -0.258862
H  3.044211 1.62215 -1.935636
H  0.384105 -3.36217 0.840952
H  -0.568767 -2.141935 1.765175
H  1.224909 -2.222054 1.934605
