program: Gaussian 09
title: 000145364
version: EM64L-G09RevD.01
frameworkgroup: C1[X(C18H25F3O)]
method: RPBEPBE
basis: SDD
operation: Freq
keyword: #p
keyword: freq=noraman
keyword: PBEPBE/SDD
title: #p freq=noraman PBEPBE/SDD
converged: YES YES NO NO
title: Mulliken charges:
elementType: F F F O C C C C C C C C C C C C C C C C C C H H H H H H H H H H H H H H H H H H H H H H H H H
charge: -0.165358 -0.165547 -0.126482 -0.170100 -0.385355 -0.387536 -0.380917 -0.367278 -0.373689 -0.389867 -0.352828 -0.573498 -0.356960 0.515003 -0.695848 -0.422749 -0.400763 -0.294643 -0.341500 0.285628 0.040914 0.285185 0.194115 0.194693 0.197608 0.196476 0.193295 0.192713 0.196959 0.195491 0.190018 0.189747 0.214807 0.215113 0.188218 0.187923 0.216521 0.214471 0.194917 0.194853 0.209843 0.215654 0.209812 0.243672 0.244485 0.258418 0.274361
chargesum: 0.00000
title: Mulliken charges with hydrogens summed into heavy atoms:
elementType: F F F O C C C C C C C C C C C C C C C C C C
charge: -0.165358 -0.165547 -0.126482 -0.170100 0.003454 0.006548 0.005091 0.025173 0.006076 0.040054 0.023312 -0.142506 0.032810 0.515003 -0.060539 -0.179078 -0.156278 -0.036225 -0.067139 0.285628 0.040914 0.285185
polarizability: 3.03037412e+02 2.08486854e+01 1.54813697e+02 2.19569028e+01 -7.76767503e+00 1.73538954e+02
1716.lowfreq: -6.0774 -2.5861 -0.0013 -0.0004 0.0008 2.9502 8.8790 16.5460 29.1244
frequency: 8.1515 16.5027 29.0917 38.2022 40.3374 52.2197 59.5336 68.0990 76.6859 101.0399 109.3695 112.2675 120.1965 135.6867 145.9332 151.7739 180.1206 210.7103 226.1075 231.0347 241.2735 277.2152 316.7278 331.8293 355.1023 365.8705 391.1650 398.3550 429.7841 449.4694 466.5303 480.6957 529.6861 554.9815 612.3365 631.3668 667.2758 697.1049 719.9932 723.4185 732.6082 751.6977 758.2047 789.4415 807.3245 839.0083 843.8414 865.7502 888.1038 895.3664 901.9205 963.0123 965.8316 979.1144 995.3609 997.6346 1001.5832 1010.2530 1015.0224 1017.7837 1049.5265 1055.3261 1059.5117 1072.9136 1076.7406 1080.1599 1082.5174 1120.9654 1130.4530 1137.1717 1182.4495 1202.7511 1206.8141 1208.4406 1226.1248 1238.2487 1241.9144 1264.6382 1272.2433 1278.0671 1278.8189 1283.7883 1287.0934 1294.3436 1295.7853 1300.0258 1322.4673 1326.2526 1340.5611 1352.1525 1356.0692 1357.1756 1384.7581 1388.5712 1422.1073 1460.5274 1460.7842 1464.3600 1465.1053 1468.5609 1473.3466 1476.1048 1478.6343 1483.9314 1488.3102 1489.9595 1501.4296 1559.2290 1597.1155 1623.6949 2950.3801 2950.6864 2952.9358 2953.8169 2958.1704 2963.7963 2968.6046 2971.9380 2972.7134 2983.4395 2985.8084 2987.8420 2994.1428 3003.2893 3014.2760 3024.1475 3033.1550 3041.8632 3054.5917 3068.6420 3070.6614 3130.0160 3134.1030 3159.7204 3174.9314
redmass: 6.2323 5.7100 3.8050 4.3635 1.8495 4.9435 6.7092 2.7693 1.6991 5.3347 4.3576 1.8597 2.5010 4.2080 2.0352 2.0749 5.0249 5.7443 1.1331 5.8826 5.1326 7.2286 4.5382 4.2927 2.9802 9.2143 3.4115 2.8160 7.8736 9.0933 3.6919 3.2412 3.3877 7.4004 7.9514 7.1301 7.9500 4.4039 1.0596 1.0712 1.0897 1.1319 4.3921 1.1861 4.2717 1.2781 1.3966 1.5728 1.8969 5.3210 1.3636 1.2317 1.7938 4.5714 3.2688 2.9014 1.7552 3.1997 3.6249 1.1340 3.2297 10.9969 3.1480 2.5460 1.2897 2.1290 2.2932 2.7377 6.2225 1.3079 1.8500 1.2072 1.3311 1.4447 2.1510 1.3779 1.3591 1.2721 1.3481 4.1969 1.0830 1.1398 1.0756 1.0986 1.1170 1.3635 1.3626 1.2931 1.4363 1.5863 1.6525 1.6275 4.3902 1.2175 3.5926 1.0753 1.0735 1.0692 1.0719 1.0834 1.0845 1.0426 1.0861 1.0924 1.0953 1.1001 2.4877 6.8004 9.1176 7.0465 1.0587 1.0587 1.0592 1.0592 1.0593 1.0589 1.0585 1.0367 1.0588 1.0963 1.0592 1.0975 1.0996 1.1018 1.1032 1.1038 1.1046 1.1046 1.1048 1.1007 1.0993 1.0891 1.0900 1.0956 1.0949
irintensity: 0.2084 0.4658 0.0760 0.0066 0.0562 0.2942 0.3712 0.0429 0.0473 0.8391 0.1743 0.0208 0.1719 0.5406 0.0294 0.0477 0.9804 1.9727 0.0128 6.6074 1.0811 0.0885 0.2155 0.3990 3.1338 2.5925 0.1835 0.0218 1.3590 1.0241 1.7512 0.7692 14.5102 16.3446 32.6556 1.2075 0.3873 30.4142 16.5765 0.0043 5.1418 0.0930 13.4483 0.9742 9.9734 0.5552 1.9501 14.2847 4.4230 110.6618 16.9642 2.4206 43.8763 11.3620 155.0600 19.9762 24.1920 0.1890 2.3924 0.3289 4.1168 137.2126 8.4808 0.6210 6.2223 0.0194 0.3298 60.1457 282.6248 7.2453 0.2384 8.4121 19.2423 6.9448 0.3951 0.1122 2.3746 0.0994 2.7204 34.9735 2.3895 0.1326 0.0897 0.0768 0.1668 3.7969 2.4809 2.0029 2.7962 0.1970 0.2951 0.3227 8.7702 11.2320 17.2665 0.0155 0.0530 0.0204 0.6337 1.6585 0.1860 12.4364 2.5231 0.0949 2.9163 38.6563 3.1994 80.4088 388.4183 27.0587 0.0467 0.0220 0.1021 4.4409 0.0490 49.8681 156.3470 34.3433 47.1691 0.0382 65.7896 0.4177 0.3094 0.2636 1.2921 0.6821 2.9339 150.9855 108.6633 97.6545 55.4586 10.0156 11.7254 5.9636 1.9279
temp: 298.150 k
press: 1.00000 atm
elementType: 9 9 9 8 6 6 6 6 6 6 6 6 6 6 6 6 6 6 6 6 6 6 1 1 1 1 1 1 1 1 1 1 1 1 1 1 1 1 1 1 1 1 1 1 1 1 1
symmnumber: 1
zpe: 1022471.1 jmol-1
zpe.correction: 0.389439 hartree
zpe.thermalcorrener: 0.413920 hartree
zpe.thermalcorrenthalpy: 0.414864 hartree
zpe.thermalcorrgfe: 0.329698 hartree
zpe.sumelectzpe: -1073.970405 hartree
zpe.sumelectthermal: -1073.945923 hartree
zpe.sumelectthermalent: -1073.944979 hartree
zpe.sumelectthermalfe: -1074.030146 hartree
dipole: -6.0956 -1.8059 -1.3971
dipole: 6.5092
quadrupole: -178.5297 -133.5556 -132.2889
quadrupole: -4.5441 -7.3972 -2.8272
quadrupole: -30.4049 14.5691 15.8358 -4.5441 -7.3972 -2.8272
hfenergy: -1074.3598433 hartree
pointgroup: C01 [X(C18H25F3O1)]
dipole: 2.3858366 -0.9305444 -0.0110674 debye
polarizability: 302.2870818|-31.9271061|154.9510887|3.6739575|-6.5979172|174.1518934 unknown
InChI: InChI=1S/C18H25F3O/c1-2-3-4-5-6-7-8-9-10-15-11-13-16(14-12-15)17(22)18(19,20)21/h11-14H,2-10H2,1H3
charge 0 multiplicity 1
47 atoms
F  -6.542274 -0.341359 1.444911
F  -5.574559 1.687225 1.818002
F  -7.493081 1.542468 0.626158
O  -5.950195 1.201914 -1.536705
C  4.923884 -0.713628 -0.078139
C  3.489375 -0.139723 -0.037926
C  6.015072 0.364295 0.11007
C  2.394675 -1.214473 -0.224485
C  7.452437 -0.201443 0.059384
C  0.966939 -0.625665 -0.202956
C  8.541045 0.879216 0.247336
C  -0.133972 -1.712177 -0.387123
C  9.979938 0.316478 0.193612
C  -1.527352 -1.113672 -0.393134
C  11.059639 1.404672 0.379101
C  -2.270703 -0.979284 0.809802
C  -2.103128 -0.622983 -1.598863
C  -3.541603 -0.376159 0.821943
C  -3.369394 -0.019498 -1.601164
C  -4.10892 0.11481 -0.389356
C  -5.436199 0.76261 -0.476173
C  -6.267664 0.917343 0.844754
H  5.084393 -1.232315 -1.046518
H  5.032928 -1.487245 0.710602
H  3.330569 0.38186 0.928909
H  3.382767 0.632447 -0.828239
H  5.858298 0.878724 1.081332
H  5.900483 1.141618 -0.674336
H  2.490876 -1.980267 0.573359
H  2.559598 -1.744116 -1.186135
H  7.568925 -0.97881 0.843558
H  7.61019 -0.714925 -0.912346
H  0.865023 0.133389 -1.004491
H  0.795563 -0.093679 0.754339
H  8.385926 1.392066 1.21981
H  8.424492 1.657882 -0.535583
H  -0.038993 -2.454579 0.428593
H  0.055878 -2.246298 -1.338481
H  10.096868 -0.459721 0.977447
H  10.133542 -0.197597 -0.777332
H  10.98534 2.174963 -0.411755
H  12.078504 0.977161 0.339753
H  10.944163 1.914456 1.354351
H  -1.844571 -1.357172 1.746442
H  -1.546959 -0.723904 -2.538295
H  -4.083408 -0.293585 1.768088
H  -3.816654 0.356579 -2.527422
