program: Gaussian 09
title: 000145352
version: EM64L-G09RevD.01
frameworkgroup: C1[X(C13H12S2)]
method: RPBEPBE
basis: SDD
operation: Freq
keyword: #pfreq=noraman
keyword: PBEPBE/SDD
title: #p freq=noraman PBEPBE/SDD
converged: YES YES NO NO
title: Mulliken charges:
elementType: S S C C C C C C C C C C C C C H H H H H H H H H H H H
charge: 0.255327 0.255327 -0.432392 -0.119535 -0.119535 -0.566634 -0.634347 0.394255 0.394256 -0.479294 -0.479295 -0.420501 -0.420500 -0.241742 -0.241743 0.254850 0.224986 0.224985 0.226341 0.226341 0.258236 0.252103 0.252104 0.240005 0.240004 0.228198 0.228199
chargesum: 0.00000
title: Mulliken charges with hydrogens summed into heavy atoms:
elementType: S S C C C C C C C C C C C C C
charge: 0.255327 0.255327 -0.432392 -0.119535 -0.119535 0.138187 0.076571 0.394255 0.394256 -0.227191 -0.227191 -0.180496 -0.180496 -0.013543 -0.013544
polarizability: 3.08688547e+02 -3.58073334e-06 1.63623137e+02 3.40543312e+00 -1.43849728e-05 8.74029908e+01
1716.lowfreq: -8.0410 -6.4649 -0.0025 0.0010 0.0018 4.5595 45.0062 83.9018 113.3719
frequency: 44.9348 83.9015 113.3712 173.1858 219.8499 234.9471 252.9760 260.1564 271.0385 289.2032 326.2883 334.4897 357.8676 359.9773 399.8610 445.3304 474.8186 501.9077 505.3056 535.3055 574.2407 601.6236 612.1282 660.2898 662.8716 756.2206 770.1444 774.2431 851.1400 860.6496 885.4438 905.7973 906.3842 940.3282 941.6371 962.3114 987.6434 998.4690 1023.6569 1098.4728 1109.7056 1134.9973 1161.6749 1172.9211 1193.3263 1225.6245 1228.9423 1269.3682 1307.6753 1381.7767 1398.3613 1401.2332 1416.3582 1427.1687 1434.9711 1446.0806 1454.3293 1467.8403 1473.2040 1497.0485 1575.6717 1581.5660 1625.3873 2979.5039 2988.0152 3073.8193 3079.5316 3096.2507 3110.3286 3120.6348 3125.8852 3136.3195 3138.8505 3143.1915 3162.6776
redmass: 3.9070 4.7045 5.9602 3.9660 1.0854 3.1422 3.9085 4.0121 1.0793 6.0850 3.4816 5.1797 4.1065 6.0749 3.4342 7.3375 2.6630 5.7825 4.5035 4.0318 8.0094 7.0312 3.7989 7.4997 5.3040 1.2383 4.5463 2.7572 1.2817 7.2104 1.4319 1.7652 2.7488 5.5955 1.4370 1.4049 1.3363 1.2710 2.2907 2.3840 1.7381 1.6128 2.0036 1.0778 4.0139 2.1749 1.3313 2.1684 1.9801 1.2042 1.2359 3.5894 3.1495 2.5237 6.0448 1.0519 1.0468 1.0444 1.0445 3.4650 7.3894 6.2406 6.5848 1.0356 1.0362 1.1000 1.0992 1.0997 1.0998 1.0856 1.0891 1.0917 1.0921 1.0947 1.1004
irintensity: 1.6672 0.1612 0.4667 1.4208 0.0074 0.0109 0.0340 0.7853 0.0729 0.1717 0.0000 0.8469 3.8955 1.0600 4.0283 0.6703 20.9932 0.3426 9.9002 0.3032 0.0075 18.9271 3.4047 12.5737 0.0161 60.6848 2.7943 0.0013 0.0005 1.1673 61.2831 0.0018 0.8832 0.4306 0.8346 9.5166 0.0002 0.2722 4.5722 58.1678 14.6693 16.0291 69.2053 0.1964 11.3684 23.7923 0.9267 4.6671 2.5193 27.8601 13.6365 6.8857 5.8849 0.3424 60.8241 8.8198 0.0011 6.2854 17.4248 21.3884 0.1384 9.7868 0.2374 19.0334 32.6114 0.9757 25.8711 16.3617 15.4759 4.0069 0.1338 5.1048 0.7824 34.2737 40.9790
temp: 298.150 k
press: 1.00000 atm
elementType: 16 16 6 6 6 6 6 6 6 6 6 6 6 6 6 1 1 1 1 1 1 1 1 1 1 1 1
symmnumber: 1
zpe: 547283.5 jmol-1
zpe.correction: 0.208449 hartree
zpe.thermalcorrener: 0.221830 hartree
zpe.thermalcorrenthalpy: 0.222774 hartree
zpe.thermalcorrgfe: 0.168883 hartree
zpe.sumelectzpe: -1297.665874 hartree
zpe.sumelectthermal: -1297.652493 hartree
zpe.sumelectthermalent: -1297.651549 hartree
zpe.sumelectthermalfe: -1297.705440 hartree
dipole: -0.6121 0.0000 1.1026
dipole: 1.2611
quadrupole: -85.5448 -97.8922 -108.3966
quadrupole: 0.0000 -2.0282 0.0000
quadrupole: 11.7331 -0.6143 -11.1187 0.0000 -2.0282 0.0000
hfenergy: -1297.8743232 hartree
pointgroup: C01 [X(C13H12S2)]
dipole: -0.2662415 -0.0000109 -0.4186882 debye
polarizability: 307.4982843|-0.0013834|163.6231367|-16.5398983|-0.0022231|88.5932538 unknown
InChI: InChI=1S/C13H12S2/c1-13(2)14-11-7-9-5-3-4-6-10(9)8-12(11)15-13/h3-8H,1-2H3
charge 0 multiplicity 1
27 atoms
S  -2.409486 1.530083 0.626695
S  -2.409504 -1.530024 0.626787
C  -3.447298 0.00002 0.09492
C  -0.798172 0.719624 0.344079
C  -0.798181 -0.719601 0.344122
C  -3.630101 -0.000025 -1.429468
C  -4.768009 0.000051 0.875267
C  1.636518 0.724954 0.03601
C  1.636509 -0.72498 0.036055
C  0.392104 1.425088 0.183416
C  0.392087 -1.42509 0.183504
C  2.880242 1.419773 -0.121176
C  2.880225 -1.419823 -0.121087
C  4.078406 0.715527 -0.270449
C  4.078398 -0.715602 -0.270405
H  -2.657617 -0.000044 -1.949887
H  -4.192157 -0.898921 -1.744402
H  -4.192149 0.898858 -1.744455
H  -5.3649 0.892743 0.612577
H  -5.364911 -0.892649 0.612629
H  -4.590099 0.000082 1.962743
H  0.390358 2.520598 0.16877
H  0.390328 -2.5206 0.168926
H  2.879376 2.516339 -0.121249
H  2.879345 -2.51639 -0.121091
H  5.023701 1.256547 -0.387756
H  5.023686 -1.25664 -0.387677
