program: Gaussian 09
title: 000145348
version: EM64L-G09RevD.01
frameworkgroup: C1[X(C21H22N4)]
method: RPBEPBE
basis: SDD
operation: Freq
keyword: #pfreq=noraman
keyword: PBEPBE/SDD
title: #p freq=noraman PBEPBE/SDD
converged: YES YES NO NO
title: Mulliken charges:
elementType: N N N N C C C C C C C C C C C C C C C C C C C C C H H H H H H H H H H H H H H H H H H H H H H
charge: -0.157194 -0.159173 -0.131836 -0.131651 -0.097275 0.292208 0.291822 0.293866 0.294671 -0.012348 -0.653825 -0.653282 -0.666208 -0.666842 0.512087 -0.393948 -0.394141 -0.421146 -0.421116 -0.497593 -0.497631 -0.239424 -0.239498 -0.236503 -0.236531 0.262953 0.228335 0.228394 0.228286 0.228240 0.262887 0.230265 0.284946 0.230235 0.284962 0.230256 0.230453 0.232252 0.232295 0.243447 0.243435 0.234928 0.234919 0.218039 0.218059 0.217470 0.217454
chargesum: 0.00000
title: Mulliken charges with hydrogens summed into heavy atoms:
elementType: N N N N C C C C C C C C C C C C C C C C C C C C C
charge: -0.157194 -0.159173 -0.131836 -0.131651 -0.097275 0.292208 0.291822 0.293866 0.294671 -0.012348 0.065857 0.066130 0.079239 0.078829 0.512087 -0.161696 -0.161845 -0.177699 -0.177680 -0.262665 -0.262713 -0.021385 -0.021439 -0.019033 -0.019077
chargesum: 0.00001
polarizability: 3.98186203e+02 -6.18530020e-02 2.38806205e+02 -2.09052407e-01 -3.54751456e-02 1.77621021e+02
1716.lowfreq: -7.6968 -0.0807 -0.0002 0.0003 4.9833 12.5597 17.8741 25.7613 39.3921
frequency: 17.8483 25.6304 38.7681 54.3707 72.6251 100.6257 105.2829 140.1545 141.8141 149.7103 200.4762 203.9291 225.7466 226.3449 233.9365 236.5688 248.4769 282.0793 283.1768 310.6668 334.3708 354.2591 373.3592 380.8600 399.2159 413.7502 436.3813 474.6083 496.0759 503.9889 515.9979 536.4924 545.9505 547.7460 564.0878 625.2960 628.7970 642.0879 642.9846 648.6886 727.1645 731.0984 736.6933 750.1470 757.4628 785.8467 819.2396 830.8539 831.5366 832.5538 841.7897 843.4900 878.2280 892.2025 937.4681 945.7153 959.1090 968.6999 976.8445 990.1464 1008.0511 1018.9445 1023.6115 1046.1613 1079.1588 1086.9775 1115.3908 1118.8094 1120.3207 1120.9336 1121.2859 1136.6748 1154.0503 1162.0571 1172.2773 1193.6631 1204.1027 1211.7424 1217.4634 1224.2853 1240.7332 1240.8871 1298.9202 1327.8548 1337.4876 1353.0473 1355.4212 1401.2282 1420.6876 1424.1906 1426.1951 1434.2625 1437.0873 1443.7100 1444.7207 1457.8088 1459.8656 1461.4048 1461.7285 1470.2848 1471.0855 1471.8019 1492.4355 1494.6485 1500.0815 1505.8527 1532.8498 1534.3923 1583.1814 1608.7884 1614.3423 1622.7976 1625.4789 2950.5646 2951.2333 2961.9582 2962.5123 3016.4681 3016.8393 3029.6200 3029.7988 3094.7378 3095.1520 3123.9589 3124.6532 3127.4760 3127.6191 3128.2317 3138.9032 3147.4589 3149.8797 3150.2886 3165.7038 3176.0400 3176.4737
redmass: 4.8818 2.4720 2.6323 1.2641 1.3416 2.4296 2.6114 2.6355 3.1499 2.8782 1.3793 3.9674 2.7417 3.3674 1.4620 3.4633 5.4668 2.4744 3.3490 3.6891 4.3372 2.9788 4.3884 6.6560 5.6135 4.5146 3.3685 3.4631 4.0100 6.5331 5.3074 6.3484 4.9464 5.5156 4.0555 5.6978 3.8823 4.5015 2.9333 5.2546 4.9337 1.2129 5.0675 1.2976 1.5306 5.0458 3.1568 4.2056 1.3612 4.1264 1.3977 3.5493 1.6167 1.3854 6.9087 1.2771 1.3110 1.3467 6.8999 3.5237 2.3150 2.2106 4.1863 4.3294 2.0462 1.9386 1.4613 1.2924 1.2943 1.2982 1.2995 2.2807 1.5555 1.3649 1.2763 1.4948 1.6902 2.3462 2.0270 2.1728 1.7896 3.1410 1.5432 3.6478 1.9568 4.2086 7.0349 6.1234 4.2581 2.3207 2.6750 2.5416 1.4653 1.3196 1.4711 1.7865 1.5189 1.0430 1.0691 2.1019 1.0435 1.0534 1.0810 1.0812 1.0841 1.0866 5.7774 4.4063 5.2982 7.5422 7.2482 7.3882 7.6517 1.0366 1.0367 1.0385 1.0385 1.1015 1.1016 1.1016 1.1015 1.0959 1.0958 1.0859 1.0859 1.0949 1.0845 1.0947 1.0894 1.0961 1.0950 1.0944 1.1001 1.0938 1.0937
irintensity: 0.1354 0.0099 0.0038 0.0058 0.1009 5.9642 0.0390 2.4151 0.1023 2.0735 0.0004 0.0044 1.3405 0.0027 0.5333 6.2169 3.7829 0.0002 0.0355 0.4400 1.1176 0.0566 0.8711 0.0027 18.4813 1.5794 0.2032 0.5855 0.0002 0.1341 17.9615 2.9090 0.0228 13.7853 0.0001 4.2764 4.4564 2.9926 0.0002 0.0001 0.0033 109.1494 11.7038 0.0002 92.0367 0.5569 59.0048 0.1655 0.0001 1.8911 0.0008 4.2574 12.7699 5.7345 8.1355 0.0000 0.0000 3.6401 6.6794 0.0031 561.5698 174.9948 13.0134 19.3669 64.0157 0.0292 32.1378 0.0025 0.0276 0.0009 0.0621 32.2140 12.9011 19.1206 7.9104 1.9986 12.2751 63.7427 32.4574 38.0631 10.7004 273.9247 3.4262 0.0153 179.6999 169.5137 68.3057 20.3308 222.7722 13.2452 54.3593 29.2658 2.2687 11.5460 137.5044 14.9211 14.2921 0.1151 4.3073 14.4140 0.7904 11.8797 95.9616 11.0237 15.5507 23.9281 466.2098 6.3218 155.7997 261.5777 9.2526 47.1600 49.4487 142.9995 1.9811 96.9647 9.6180 0.6620 62.2219 3.0575 52.4031 2.8791 15.0085 11.8846 4.1005 0.1281 0.1444 7.9799 15.1634 11.5782 64.7307 31.9645 27.3920 29.0910 0.8990
temp: 298.150 k
press: 1.00000 atm
elementType: 7 7 7 7 6 6 6 6 6 6 6 6 6 6 6 6 6 6 6 6 6 6 6 6 6 1 1 1 1 1 1 1 1 1 1 1 1 1 1 1 1 1 1 1 1 1 1
symmnumber: 1
zpe: 1009267.3 jmol-1
zpe.correction: 0.384410 hartree
zpe.thermalcorrener: 0.406563 hartree
zpe.thermalcorrenthalpy: 0.407507 hartree
zpe.thermalcorrgfe: 0.332865 hartree
zpe.sumelectzpe: -1030.679177 hartree
zpe.sumelectthermal: -1030.657024 hartree
zpe.sumelectthermalent: -1030.656080 hartree
zpe.sumelectthermalfe: -1030.730722 hartree
dipole: -0.9940 0.0007 0.0066
dipole: 0.9940
quadrupole: -156.9134 -139.2197 -141.1683
quadrupole: -0.0360 -0.1214 -0.0131
quadrupole: -11.1463 6.5474 4.5989 -0.0360 -0.1214 -0.0131
hfenergy: -1031.063587 hartree
pointgroup: C01 [X(C21H22N4)]
dipole: 0.3910372 0.0011196 0.0041176 debye
polarizability: 398.1797285|0.5071396|238.8051545|1.0575529|0.4068903|177.6285469 unknown
InChI: InChI=1S/C21H22N4/c1-22-16-11-5-6-12-17(16)23(2)21(22)24(3)18-13-7-9-15-10-8-14-19(20(15)18)25(21)4/h5-14H,1-4H3
charge 0 multiplicity 1
47 atoms
N  1.544752 0.0002 -1.135106
N  1.546334 -0.0088 1.147609
N  -0.261204 1.201502 0.013698
N  -0.249277 -1.228598 0.004347
C  0.5897 -0.00929 0.007284
C  2.880879 0.00058 -0.710805
C  2.881974 -0.00492 0.721297
C  -1.667741 1.221662 0.002833
C  -1.655433 -1.262665 -0.009711
C  -2.385127 -0.024051 -0.009448
C  1.088008 -0.000211 -2.516588
C  1.091715 -0.018979 2.529705
C  0.471413 2.477095 0.019839
C  0.49593 -2.496889 0.000816
C  -3.827892 -0.031121 -0.021366
C  4.081704 0.005174 -1.436563
C  4.083754 -0.005794 1.445393
C  -2.389718 2.436066 0.00364
C  -2.365283 -2.484113 -0.022885
C  -4.528904 1.219619 -0.020179
C  -4.516442 -1.288717 -0.033923
C  5.303555 0.004643 -0.702395
C  5.304591 -0.000719 0.709507
C  -3.813855 2.419119 -0.007737
C  -3.789508 -2.481128 -0.03471
H  -0.014153 0.007518 -2.531476
H  1.435243 -0.901587 -3.060222
H  1.447444 0.894571 -3.062869
H  1.452135 0.871842 3.081769
H  1.439608 -0.924281 3.066337
H  -0.010415 -0.011271 2.545822
H  0.229808 3.079043 -0.877858
H  1.552572 2.281074 0.02443
H  0.221561 3.074702 0.918101
H  1.575157 -2.290725 0.012558
H  0.26453 -3.092426 -0.903859
H  0.247669 -3.105611 0.891975
H  4.085725 0.008762 -2.531578
H  4.089308 -0.010498 2.540397
H  -1.871338 3.397289 0.01304
H  -1.837357 -3.440172 -0.024064
H  -5.624227 1.217024 -0.029091
H  -5.611739 -1.296911 -0.042848
H  6.254224 0.008194 -1.246645
H  6.256034 -0.001297 1.252403
H  -4.349273 3.375618 -0.006712
H  -4.315444 -3.442823 -0.044664
