program: Gaussian 09
title: 000145329
version: EM64L-G09RevD.01
frameworkgroup: C1[X(C12Br2F8N2)]
method: RPBEPBE
basis: SDD
operation: Freq
keyword: #p
keyword: freq=noraman
keyword: PBEPBE/SDD
title: #p freq=noraman PBEPBE/SDD
converged: NO YES NO NO
title: Mulliken charges:
elementType: Br Br F F F F F F F F N N C C C C C C C C C C C C
charge: 0.170517 0.170502 -0.136789 -0.136696 -0.136779 -0.136689 -0.143994 -0.143986 -0.143988 -0.143984 -0.040184 -0.040237 0.109653 0.109591 0.091591 0.091706 0.091419 0.091520 0.416504 0.416404 0.416457 0.416364 -0.694515 -0.694386
chargesum: 0.00000
title: Mulliken charges with hydrogens summed into heavy atoms:
polarizability: 3.50342266e+02 -3.79692381e-04 1.67513863e+02 6.52833711e+00 8.92047268e-04 6.71180548e+01
1716.lowfreq: -152.2042 -19.0734 -1.9819 -0.0009 -0.0005 -0.0002 2.6309 8.0036 20.2388
frequency: -152.2041 -19.0733 20.2388 22.4721 50.6249 100.4437 101.0493 118.5820 118.6157 133.0893 141.8685 149.3964 170.1592 170.9714 192.9410 233.1118 239.6664 241.4878 265.4106 270.9938 278.9408 281.5578 314.4080 346.7789 362.2455 369.3546 370.2830 405.9539 416.0548 421.6754 429.1687 471.3484 477.4872 553.7312 560.9681 631.9453 632.7635 646.5044 692.2705 716.0958 724.4977 764.2799 772.4825 780.4401 829.5149 898.9497 923.6230 950.4699 997.8531 1070.4564 1074.3739 1190.8181 1201.9169 1354.8948 1356.2451 1358.4900 1362.8411 1407.7097 1410.1792 1429.8996 1444.5526 1462.2942 1575.9284 1590.9388 1602.8340 1603.9247
redmass: 14.3364 17.6317 25.9546 21.5140 20.0864 22.2770 18.6310 18.5052 18.5402 19.6976 21.3605 23.1464 17.3325 15.6554 14.6049 28.7199 13.9031 25.3121 19.1132 18.7507 18.4907 18.4002 13.3095 16.9250 14.1282 13.2344 12.6949 12.5594 16.2227 15.9861 15.8219 16.5604 16.5963 15.6218 12.7751 12.1869 12.1921 12.1995 12.6232 13.1838 12.6778 12.8396 12.1775 13.5372 12.9203 14.3702 14.2111 13.0052 12.9873 13.6033 13.5981 12.5411 12.5735 12.6293 12.6026 12.0055 12.0015 12.1586 12.1560 12.2831 12.2754 13.9427 12.0188 12.0200 12.0181 12.0191
irintensity: 0.0020 0.0075 0.0566 0.0202 0.0000 0.0031 0.6574 0.0001 0.0005 0.0000 0.0002 0.2801 0.0336 1.9068 0.0000 0.2230 0.6509 0.0000 1.5442 0.0000 1.2929 0.0001 0.0000 8.5342 0.0090 0.0276 0.0001 4.3385 0.0000 0.0000 0.0341 1.1733 0.0000 13.3482 0.0006 0.0162 0.0001 13.2429 0.0002 0.0003 0.5242 0.0017 26.4970 171.6229 0.0021 0.0015 252.9715 0.0014 12.5903 0.0001 0.0425 0.0008 1.3935 0.0158 24.4835 0.0009 0.2549 0.1050 105.5132 0.0058 585.1752 0.0027 0.0003 0.3730 5.3741 0.0507
temp: 298.150 k
press: 1.00000 atm
elementType: 35 35 9 9 9 9 9 9 9 9 7 7 6 6 6 6 6 6 6 6 6 6 6 6
symmnumber: 1
zpe: 258758.6 jmol-1
zpe.correction: 0.098556 hartree
zpe.thermalcorrener: 0.119224 hartree
zpe.thermalcorrenthalpy: 0.120168 hartree
zpe.thermalcorrgfe: 0.046440 hartree
zpe.sumelectzpe: -1390.598762 hartree
zpe.sumelectthermal: -1390.578095 hartree
zpe.sumelectthermalent: -1390.577150 hartree
zpe.sumelectthermalfe: -1390.650878 hartree
dipole: -0.0013 -0.0005 -0.0015
dipole: 0.0020
quadrupole: -138.5600 -167.9585 -147.4285
quadrupole: 0.0002 -0.3418 -0.0001
quadrupole: 12.7556 -16.6428 3.8872 0.0002 -0.3418 -0.0001
hfenergy: -1390.6973185 hartree
pointgroup: C01 [X(C12Br2F8N2)]
dipole: -0.0005029 0.0002098 0.0005904 debye
dipolederiv: -0.522433 -0.0000802 0.0455826 -0.0001138 0.0841833 0.0000336 0.0462543 0.0000285 0.0992133 -0.5221876 0.0000739 0.0467016 0.0001242 0.084172 -0.0000413 0.0475091 -0.0000277 0.0991617 -0.3800875 0.3130596 0.0317202 0.278509 -0.7022083 -0.0401538 0.0573294 -0.027983 -0.0866088 -0.3801926 -0.3131351 0.0323674 -0.2786371 -0.702284 0.0409937 0.0578995 0.0287038 -0.0866861 -0.3798046 -0.312799 0.032828 -0.278047 -0.7024837 0.0424117 0.0581207 0.0300453 -0.086843 -0.3798866 0.3128547 0.0334684 0.2781675 -0.7025865 -0.0433071 0.0586943 -0.0307602 -0.086965 -0.3914738 0.3267895 0.0106823 0.3879206 -0.7461839 -0.0175328 0.0297286 -0.035155 -0.0986052 -0.3915579 -0.3268436 0.011032 -0.3879465 -0.7462244 0.017965 0.0303809 0.0357186 -0.0985919 -0.3910368 -0.3264887 0.0117127 -0.3875361 -0.7463903 0.0196689 0.0311174 0.0371828 -0.0987884 -0.3911214 0.3265198 0.0121074 0.3875553 -0.7464194 -0.0201113 0.0317953 -0.0377416 -0.0988426 -0.181515 0.0001111 0.0539044 -0.0045955 -0.0697184 0.0000012 0.1093598 0.000268 0.0108699 -0.174892 -0.0001334 0.0540718 0.0046489 -0.0697736 -0.0000056 0.1038043 -0.0002678 0.0112402 0.4020832 -0.000157 -0.0480157 0.0003571 -0.0527333 0.0000783 -0.1491551 0.0001285 0.0181298 0.3987967 0.0001948 -0.0475104 -0.0004171 -0.0527353 -0.0001688 -0.1458979 -0.0001303 0.017966 0.2770212 -0.4644748 -0.0321389 -0.1405674 0.7425475 0.0612706 -0.03181 0.0327847 0.0515471 0.2782248 0.4647533 -0.0330735 0.139574 0.7426823 -0.0620668 -0.0327154 -0.033898 0.0518213 0.2771377 0.4642025 -0.0337388 0.1404948 0.7428768 -0.0637732 -0.0296998 -0.0350771 0.0519069 0.2783277 -0.4644808 -0.0346413 -0.1394694 0.7430411 0.0646678 -0.030503 0.0361856 0.0522304 0.1673251 -0.5385916 0.0107197 -0.2829624 0.8379991 0.0200581 -0.0155275 0.0573781 0.1739437 0.1667884 0.5389012 0.0110736 0.282915 0.8379024 -0.020465 -0.0154892 -0.0583778 0.1737483 0.1670958 0.5381839 0.0091219 0.2822487 0.8382257 -0.0221278 -0.0162079 -0.0594129 0.1742134 0.1665324 -0.5384646 0.0094082 -0.2822366 0.8381259 0.022643 -0.0161802 0.0604092 0.1740972 0.9534025 0.000197 -0.0925182 0.0004021 -0.2261495 0.0000083 -0.0881591 -0.0000014 -0.2092432 0.9534531 -0.0001923 -0.0948654 -0.0003883 -0.2258653 -0.0000468 -0.0906486 -0.0000001 -0.2089149 unknown
polarizability: 350.034821|0.0007673|167.5138631|-11.384221|0.0009673|67.4254996 unknown
InChI: InChI=1S/C12Br2F8N2/c13-1-3(15)7(19)11(8(20)4(1)16)23-24-12-9(21)5(17)2(14)6(18)10(12)22
charge 0 multiplicity 1
24 atoms
Br 6.555335 0.000521 -0.221719
Br -6.554697 0.000535 0.228511
F  1.828882 2.417445 0.212362
F  -1.829164 2.41735 -0.215583
F  1.830358 -2.417859 0.22029
F  -1.830733 -2.417883 -0.223508
F  4.586169 -2.426595 -0.043768
F  -4.586123 -2.426607 0.046364
F  4.584678 2.427008 -0.05157
F  -4.58458 2.42697 0.054153
N  0.37609 -0.000283 0.520359
N  -0.376067 -0.00033 -0.524974
C  1.80007 -0.000224 0.21766
C  -1.800609 -0.000278 -0.220618
C  2.516989 1.210353 0.151223
C  -2.517146 1.21043 -0.152902
C  2.517747 -1.210574 0.155227
C  -2.517936 -1.210732 -0.156905
C  3.920168 -1.21128 0.024943
C  -3.920129 -1.21137 -0.023641
C  3.919423 1.211513 0.021026
C  -3.919342 1.211546 -0.019736
C  4.640693 0.000234 -0.043181
C  -4.640379 0.000212 0.045987
