program: Gaussian 09
title: 000145321
version: EM64L-G09RevD.01
frameworkgroup: C1[X(C13H19Cl)]
method: RPBEPBE
basis: SDD
operation: Freq
keyword: #p
keyword: freq=noraman
keyword: PBEPBE/SDD
title: #p freq=noraman PBEPBE/SDD
converged: NO NO NO NO
title: Mulliken charges:
elementType: Cl C C C C C C C C C C C C C H H H H H H H H H H H H H H H H H H H
charge: -0.080256 -0.249028 0.451010 -0.235497 0.710366 0.259334 -0.620949 -0.398138 -0.470791 -0.693934 -0.693929 -0.691952 -0.691961 -0.856335 0.227691 0.233081 0.234581 0.254486 0.214935 0.213020 0.225360 0.225354 0.213020 0.214952 0.208621 0.213907 0.230450 0.230448 0.213910 0.208607 0.233108 0.233419 0.233110
chargesum: 0.00000
title: Mulliken charges with hydrogens summed into heavy atoms:
elementType: Cl C C C C C C C C C C C C C
charge: -0.080256 -0.021336 0.451010 -0.002417 0.710366 0.259334 -0.386368 -0.143652 -0.470791 -0.040619 -0.040603 -0.038975 -0.038996 -0.156698
polarizability: 1.91944083e+02 3.68468346e+00 1.57847178e+02 -3.71840739e-03 -9.51540658e-03 1.03082008e+02
1716.lowfreq: -9.8379 -7.6065 -0.0029 -0.0028 -0.0027 10.5071 16.3024 18.6991 61.2351
frequency: 15.9628 17.9844 61.2325 109.7937 139.0088 148.3447 166.3778 167.3404 212.0566 213.5167 223.0590 240.6215 242.1498 255.6365 279.8702 300.0960 339.4442 358.9707 395.1624 462.4636 464.8869 473.0396 479.7172 573.2328 587.3896 664.3659 688.8815 736.3352 746.4093 863.7234 888.6452 889.4310 896.1480 915.9041 919.4733 947.4310 954.7959 955.7093 996.1955 1040.8906 1062.1664 1082.1383 1113.9122 1114.0863 1116.1467 1143.0131 1172.9220 1199.9820 1259.5732 1262.7430 1308.0384 1309.3779 1316.1514 1336.3059 1372.4945 1376.9940 1377.6852 1385.1880 1396.4543 1398.1144 1401.2218 1464.6465 1465.7711 1467.8800 1467.9543 1468.5989 1472.7413 1479.2887 1479.6579 1480.9992 1485.6715 1492.8655 1561.0600 1611.9907 2971.1382 2972.3876 2972.7690 2974.9995 2975.5223 3006.3084 3018.4871 3046.3002 3064.3527 3066.3212 3073.3545 3073.6953 3074.7866 3077.2502 3078.9611 3080.9613 3081.8531 3113.0431 3143.4430
redmass: 2.7193 2.7473 3.1729 4.0193 2.7927 3.4460 1.0321 4.6758 1.0630 1.0848 2.5955 1.0846 1.1422 2.7227 3.7307 3.3747 2.5616 8.5191 2.5254 3.6106 3.4641 2.8030 3.2234 3.4008 3.5940 5.2189 4.3017 3.4516 2.9192 2.9676 1.5127 2.5320 1.4182 1.1786 1.1853 3.0537 1.4394 1.4326 1.4883 1.5484 1.6994 1.5451 2.6290 2.6574 2.6469 1.8771 2.1074 1.8079 3.6358 1.2834 2.6192 1.3085 1.3036 1.4369 4.8591 1.1930 1.1920 2.0468 1.2054 1.2872 1.2634 1.0452 1.0458 1.6694 1.0502 1.0510 1.0466 1.0480 1.0501 1.1138 1.0600 1.4652 7.2246 6.7939 1.0379 1.0348 1.0347 1.0354 1.0352 1.0839 1.0845 1.0975 1.1000 1.1001 1.0990 1.0989 1.1005 1.1005 1.0988 1.0985 1.0995 1.0899 1.0912
irintensity: 0.0122 0.0716 0.4047 0.5012 0.1696 0.4227 0.2265 0.9640 0.0022 0.0278 0.2629 0.1334 0.0331 0.0567 0.4034 0.3965 0.0364 5.6748 0.4316 7.1624 4.3854 0.1271 0.8438 2.5008 2.0223 1.2509 18.4886 9.6516 0.1526 4.5305 4.3768 4.4526 19.8394 1.4390 1.8328 26.2939 0.2075 0.0741 18.5490 6.1589 26.4379 22.0349 1.5408 14.9555 3.0313 3.8195 0.8104 6.6360 9.5644 1.6171 24.4629 1.0092 0.5747 0.2112 13.0630 15.0115 17.0232 1.0802 0.5306 35.0320 5.1233 1.5462 0.5290 15.0755 4.9758 2.5011 16.9412 5.7335 36.8432 0.7458 0.7152 70.3902 4.8768 1.9235 31.0317 26.0118 35.8893 61.5405 12.2127 10.8997 0.3410 18.3456 0.3423 0.0099 190.4404 0.0397 22.3159 23.9036 54.1648 19.5441 35.5446 22.4624 4.1697
temp: 298.150 k
press: 1.00000 atm
elementType: 17 6 6 6 6 6 6 6 6 6 6 6 6 6 1 1 1 1 1 1 1 1 1 1 1 1 1 1 1 1 1 1 1
symmnumber: 1
zpe: 740497.2 jmol-1
zpe.correction: 0.282040 hartree
zpe.thermalcorrener: 0.298414 hartree
zpe.thermalcorrenthalpy: 0.299358 hartree
zpe.thermalcorrgfe: 0.236930 hartree
zpe.sumelectzpe: -965.776748 hartree
zpe.sumelectthermal: -965.760375 hartree
zpe.sumelectthermalent: -965.759431 hartree
zpe.sumelectthermalfe: -965.821859 hartree
dipole: -1.2987 -2.2176 0.0004
dipole: 2.5699
quadrupole: -85.6880 -93.1324 -96.0874
quadrupole: -2.1840 0.0002 -0.0003
quadrupole: 5.9479 -1.4965 -4.4514 -2.1840 0.0002 -0.0003
hfenergy: -966.0587886 hartree
pointgroup: C01 [X(C13H19Cl1)]
dipole: 0.4596413 -0.9005713 -0.0001406 debye
polarizability: 191.4045108|-5.6288109|158.3867505|-0.0031618|0.0097145|103.082008 unknown
InChI: InChI=1S/C13H19Cl/c1-8(2)11-7-13(14)12(9(3)4)6-10(11)5/h6-9H,1-5H3
charge 0 multiplicity 1
33 atoms
Cl -1.389971 2.887036 0.00051
C  2.986188 -0.100943 0.000054
C  1.451417 -0.087519 0.000089
C  -2.973871 0.080595 0.000104
C  -1.44274 0.054801 0.000094
C  0.670819 -1.284912 -0.000075
C  -0.740373 -1.179027 -0.00007
C  0.773521 1.155241 0.000253
C  -0.631137 1.212886 0.00026
C  3.562334 0.56734 1.278155
C  3.562201 0.567065 -1.278256
C  -3.549847 -0.583345 1.279513
C  -3.549911 -0.583485 -1.2792
C  1.31138 -2.665571 -0.000278
H  3.320685 -1.155246 0.000155
H  -3.291622 1.139495 0.000053
H  -1.331289 -2.104038 -0.000211
H  1.344334 2.08978 0.000387
H  3.282851 1.636145 1.327787
H  4.666835 0.506295 1.282885
H  3.182322 0.077447 2.192958
H  3.182222 0.076869 -2.19291
H  4.66671 0.506182 -1.283017
H  3.282543 1.635811 -1.328165
H  -3.273211 -1.652992 1.335526
H  -4.654068 -0.519141 1.280485
H  -3.17268 -0.086179 2.191198
H  -3.172658 -0.086534 -2.190968
H  -4.654122 -0.519126 -1.2802
H  -3.273448 -1.653188 -1.335028
H  1.950697 -2.824807 0.888917
H  0.539294 -3.45389 -0.000389
H  1.950695 -2.824544 -0.889517
