program: Gaussian 09
title: 000145299
version: EM64L-G09RevD.01
frameworkgroup: C1[X(C7H12ClN)]
method: RPBEPBE
basis: SDD
operation: Freq
keyword: #p
keyword: freq=noraman
keyword: PBEPBE/SDD
title: #p freq=noraman PBEPBE/SDD
converged: YES YES NO NO
title: Mulliken charges:
elementType: Cl N C C C C C C C H H H H H H H H H H H H
charge: -0.086578 0.041786 -0.112017 -0.407474 -0.451716 -0.450742 -0.419844 -0.464010 -0.448218 0.215482 0.241482 0.223032 0.213588 0.215397 0.218484 0.211156 0.293636 0.236761 0.241467 0.225187 0.263141
chargesum: 0.00000
title: Mulliken charges with hydrogens summed into heavy atoms:
elementType: Cl N C C C C C C C
charge: -0.086578 0.041786 0.103465 0.057040 -0.022731 -0.021101 -0.126209 0.014218 0.040110
polarizability: 1.00611943e+02 -3.85958227e+00 7.60073979e+01 1.04263194e+00 -1.35270576e+00 7.70044228e+01
1716.lowfreq: -17.1951 -2.3974 0.0010 0.0028 0.0038 16.9217 83.3430 205.8981 226.5144
frequency: 83.1570 205.8955 226.5106 286.3651 339.9275 343.1306 398.4975 509.5186 554.4718 593.5643 662.1125 750.1604 792.8509 795.6635 819.3615 866.6446 886.3926 919.8769 947.7781 976.9320 983.7728 1019.0684 1049.1789 1066.9359 1088.9622 1119.6798 1138.3910 1171.6988 1200.3610 1214.4304 1242.7067 1261.4415 1271.1722 1303.0871 1306.7681 1315.8281 1316.9347 1337.0830 1338.2370 1347.0469 1458.9555 1461.0370 1467.0521 1469.9542 1484.2506 2985.6222 2987.2951 3004.2691 3005.8815 3018.3835 3039.3490 3044.3560 3045.8183 3058.6005 3072.1990 3079.6932 3086.2464
redmass: 3.0600 2.3527 3.4818 3.2793 2.5236 2.0832 2.4396 4.3270 3.9133 5.7097 3.1959 4.6725 2.1435 1.6687 1.3662 2.6151 2.4144 2.1928 2.6854 2.4735 2.3062 2.8688 2.9280 2.7608 1.5442 1.5304 1.1167 1.2270 1.3323 1.2758 1.2120 1.4251 1.4973 1.3192 1.3348 1.4061 1.4054 1.3670 1.4054 1.3380 1.0818 1.0772 1.0847 1.0798 1.0882 1.0599 1.0593 1.0609 1.0611 1.0615 1.0962 1.0967 1.1015 1.0944 1.1043 1.0995 1.1056
irintensity: 1.3691 1.4976 0.3642 3.4652 10.9638 0.5561 1.3565 2.8159 14.1279 8.4620 45.1915 17.0472 13.5571 3.1616 21.0926 6.5957 11.4131 10.9314 40.3994 29.3081 6.9368 4.4563 16.9483 21.9141 2.3328 0.6336 0.3824 1.6636 14.2024 15.7207 7.3953 6.4483 14.2682 7.6400 4.5825 7.9862 3.4635 2.4531 0.6938 4.1122 6.7271 6.8890 14.6218 19.1936 6.4288 36.2653 33.1500 25.4850 63.6539 57.8641 19.2793 34.3556 24.8875 1.2706 8.8461 68.8874 34.3050
temp: 298.150 k
press: 1.00000 atm
elementType: 17 7 6 6 6 6 6 6 6 1 1 1 1 1 1 1 1 1 1 1 1
symmnumber: 1
zpe: 477433.0 jmol-1
zpe.correction: 0.181845 hartree
zpe.thermalcorrener: 0.189677 hartree
zpe.thermalcorrenthalpy: 0.190621 hartree
zpe.thermalcorrgfe: 0.149194 hartree
zpe.sumelectzpe: -788.021145 hartree
zpe.sumelectthermal: -788.013313 hartree
zpe.sumelectthermalent: -788.012369 hartree
zpe.sumelectthermalfe: -788.053796 hartree
dipole: -3.7404 -0.6069 -1.0202
dipole: 3.9242
quadrupole: -67.5276 -61.3470 -60.0506
quadrupole: -1.7855 -1.4159 -2.2966
quadrupole: -4.5525 1.6281 2.9245 -1.7855 -1.4159 -2.2966
hfenergy: -788.20299 hartree
pointgroup: C01 [X(C7H12Cl1N1)]
dipole: -1.4859246 -0.3727776 -0.1915849 debye
dipolederiv: -0.9459438 0.0653061 -0.0168599 0.0476129 -0.2482265 -0.0039247 -0.1955587 0.0145628 -0.2093408 -0.6750718 -0.0684858 -0.0472377 0.2202479 -0.6769826 -0.0273432 0.0666506 -0.0600233 -0.4331454 0.127204 0.0184065 0.0072768 -0.033018 0.1107159 -0.0167482 -0.0257965 -0.0183419 0.0819361 -0.1878907 -0.0282583 0.0185071 0.0325016 -0.0947759 0.0343326 -0.0217384 0.0788914 0.0553742 0.0027261 0.0151406 -0.0682541 -0.0291303 -0.0826206 0.0466936 -0.0551182 0.0782563 0.0597095 0.062527 -0.0849098 0.0050845 -0.0681363 0.0017199 -0.0261201 -0.0107361 -0.080949 -0.0598172 1.3757152 -0.1125307 -0.0187908 -0.2513737 0.5309963 0.0465228 0.0226621 0.0711769 0.2891486 0.3254129 0.0056478 0.0960205 -0.0457955 0.333476 -0.0522861 0.1776792 -0.0755652 0.2271482 0.1604028 0.0901313 -0.0099664 0.0812778 0.2569084 0.0249422 -0.0801772 0.0256198 0.3291863 -0.0437298 -0.1132716 -0.008842 -0.1069375 -0.1215671 -0.0123939 -0.0017962 -0.0079465 0.0549434 0.0311731 0.0584661 -0.0586182 0.0524184 0.0010311 0.0540696 -0.0607473 0.1091949 0.0046567 0.0275004 -0.0226095 0.0179357 -0.0123226 0.0124602 -0.0890697 0.0373062 -0.1372582 -0.1186708 -0.2018853 0.0297311 0.0133392 0.0256155 0.045208 -0.0137064 0.0871379 -0.0080501 0.0689243 0.0698728 -0.0031314 0.0214167 -0.0395482 0.0286685 -0.064302 -0.0471063 -0.0601635 -0.1833293 0.0421205 0.0601652 -0.0701338 0.0024215 -0.0763635 0.150716 -0.0329864 0.1002155 -0.0485153 -0.1647634 0.0272268 0.111899 0.0688818 0.0358403 -0.0420469 0.06503 -0.0239989 0.0391082 -0.0000959 -0.0147308 -0.0495695 -0.0208636 0.0201752 0.039943 0.0120969 0.0383567 -0.1119514 0.0565725 -0.0668633 0.0542454 -0.0361697 0.0229236 0.0565899 0.0177329 0.1211225 -0.130302 -0.0430301 0.0838972 0.0272274 0.0543808 -0.0519309 -0.0595438 0.0579933 -0.1236934 0.0353846 0.0236315 0.0702155 0.0909745 0.0348383 -0.0997343 -0.1143809 0.0498863 -0.068078 0.0153281 -0.042448 -0.009543 -0.1156543 0.023099 0.0520779 0.0680562 -0.0624142 0.0266713 0.034224 unknown
polarizability: 100.4389979|-3.468208|75.2690287|2.9003662|-0.128506|77.9157371 unknown
InChI: InChI=1S/C7H12ClN/c8-7-5-6-1-3-9(7)4-2-6/h6-7H,1-5H2
charge 0 multiplicity 1
21 atoms
Cl 2.892312 -0.117319 -0.023148
N  0.360228 1.073651 0.04081
C  -1.082122 -1.074276 -0.043095
C  0.372636 -1.367767 -0.523955
C  -1.724001 0.028332 -0.934661
C  -1.007281 -0.550567 1.417309
C  1.078989 0.009686 -0.66188
C  -0.889117 1.351004 -0.747594
C  -0.002596 0.657669 1.432033
H  -1.682479 -2.000111 -0.090826
H  0.885724 -2.009766 0.21391
H  0.386302 -1.897265 -1.494059
H  -2.778488 0.183282 -0.639652
H  -1.722685 -0.293434 -1.993816
H  -0.663345 -1.353868 2.095223
H  -2.013301 -0.238689 1.756651
H  1.212448 0.315117 -1.711718
H  -0.601752 1.790451 -1.71987
H  -1.459234 2.116288 -0.192181
H  -0.432531 1.537242 1.941631
H  0.936292 0.397339 1.949087
