program: Gaussian 09
title: 000145289
version: EM64L-G09RevD.01
frameworkgroup: C1[X(C12H12N2O2S)]
method: RPBEPBE
basis: SDD
operation: Freq
keyword: #p
keyword: freq=noraman
keyword: PBEPBE/SDD
title: #p freq=noraman PBEPBE/SDD
converged: YES YES NO NO
title: Mulliken charges:
elementType: S O O N N C C C C C C C C C C C C H H H H H H H H H H H H
charge: 0.087972 -0.377289 -0.224694 -0.147236 0.049728 0.418236 0.500206 -0.337850 -0.353463 -0.393972 -0.329848 -0.353364 -0.643958 -0.645174 -0.065634 0.041768 -0.285506 0.245102 0.241232 0.285825 0.231718 0.242522 0.221370 0.242818 0.222933 0.240604 0.240385 0.273756 0.371812
chargesum: 0.00000
title: Mulliken charges with hydrogens summed into heavy atoms:
elementType: S O O N N C C C C C C C C C C C C
charge: 0.087972 -0.005477 -0.224694 -0.147236 0.049728 0.418236 0.500206 -0.092748 -0.112231 -0.108147 -0.098130 -0.353364 0.062752 0.058748 -0.065634 0.041768 -0.011750
polarizability: 3.55380317e+02 9.44071011e+00 1.91057106e+02 5.76295918e-02 4.88439305e-02 7.32803557e+01
1716.lowfreq: -6.5370 -5.0620 -0.0015 0.0009 0.0013 6.8245 29.8887 37.5604 57.0194
frequency: 29.8413 37.5539 57.0068 80.7035 84.7592 119.6541 130.8715 175.0694 192.3234 197.7439 216.0541 221.9331 279.8781 298.6929 329.2009 345.0483 363.9005 417.6057 421.5200 451.0993 474.4548 498.8664 507.9047 528.8481 555.2715 593.8928 616.9020 640.1396 683.2821 704.3976 727.6984 743.0205 800.3530 834.6100 842.1935 853.3081 862.1141 940.2752 944.5004 992.6967 993.0439 1056.6574 1105.0143 1113.0677 1118.0613 1138.1307 1145.5598 1167.2735 1195.0919 1210.3536 1253.8736 1255.1304 1297.3818 1321.6695 1370.1258 1378.3959 1432.5038 1455.1535 1460.1543 1467.0406 1479.4624 1490.0913 1502.7024 1524.2954 1534.0551 1550.1362 1613.1559 1632.2110 1659.4193 2952.8303 2959.8850 3022.5815 3026.9232 3104.6359 3114.6174 3132.2155 3155.2325 3170.4391 3175.5878 3176.2522 3542.5405
redmass: 4.3306 6.3154 6.0439 2.2843 6.1772 2.2558 2.2301 5.0546 1.1414 5.9570 4.7914 3.0556 1.1751 6.2766 3.8258 6.7291 7.8465 2.9696 3.8490 8.7424 4.3746 3.1248 7.0155 4.4782 4.5651 4.2296 7.3465 6.6513 8.4114 4.8330 5.7667 3.7747 1.3326 1.6890 6.1970 1.5189 6.4874 3.1220 1.3820 1.3519 2.8472 1.5127 1.2372 1.3292 2.6894 1.9060 1.9117 1.6852 1.5917 1.4856 2.7939 2.5613 1.9056 1.3898 3.1222 4.2426 1.2148 2.5077 1.3630 1.0392 1.0448 1.1242 1.1706 3.8633 4.4867 5.7080 8.5928 6.3186 8.7466 1.0367 1.0390 1.1003 1.1025 1.0969 1.0949 1.0886 1.0879 1.0935 1.0904 1.0960 1.0662
irintensity: 0.3847 2.3651 0.3511 0.0061 2.5923 5.1762 0.0146 0.2564 0.0024 1.6336 0.5594 11.1990 133.7486 4.8777 17.6370 7.9817 1.1685 0.0194 17.5641 54.3125 5.3795 7.5777 6.1812 17.5147 21.1529 8.5969 1.1977 5.3192 16.1541 3.2908 26.0471 1.0166 11.4086 61.2943 264.9112 45.3934 18.5096 24.7065 0.1722 1.3387 1.2168 23.3677 0.0056 1.0145 330.7211 127.8553 125.2440 10.0587 433.6121 23.0482 57.3681 40.3716 257.6595 14.1749 164.4240 20.2860 7.5409 35.4349 27.6907 0.0204 24.7457 3.1048 33.8606 867.4445 113.8562 40.4921 404.6748 426.7426 255.4265 83.9457 124.6658 15.2561 56.9778 3.8997 41.5109 7.7708 1.5121 13.4884 2.1090 13.4615 51.3026
temp: 298.150 k
press: 1.00000 atm
elementType: 16 8 8 7 7 6 6 6 6 6 6 6 6 6 6 6 6 1 1 1 1 1 1 1 1 1 1 1 1
symmnumber: 1
zpe: 569710.4 jmol-1
zpe.correction: 0.216991 hartree
zpe.thermalcorrener: 0.233694 hartree
zpe.thermalcorrenthalpy: 0.234639 hartree
zpe.thermalcorrgfe: 0.171447 hartree
zpe.sumelectzpe: -1121.233720 hartree
zpe.sumelectthermal: -1121.217017 hartree
zpe.sumelectthermalent: -1121.216072 hartree
zpe.sumelectthermalfe: -1121.279264 hartree
dipole: -8.8993 -5.7500 0.0132
dipole: 10.5953
quadrupole: -84.4202 -107.4547 -111.0755
quadrupole: -19.7918 0.0514 -0.0832
quadrupole: 16.5633 -6.4712 -10.0921 -19.7918 0.0514 -0.0832
hfenergy: -1121.450711 hartree
pointgroup: C01 [X(C12H12N2O2S1)]
dipole: -3.5803861 -1.9347996 0.9021163 debye
polarizability: 355.7047075|0.6925932|173.1786667|-7.2308683|-41.6722589|90.8344038 unknown
InChI: InChI=1S/C12H12N2O2S/c1-14(2)9-5-3-8(4-6-9)12-13-10(15)7-11(16)17-12/h3-7,16H,1-2H3
charge 0 multiplicity 1
29 atoms
S  2.083448 -1.605448 0.474589
O  4.769495 -2.025947 0.593979
O  3.771562 2.292158 -1.18251
N  -4.502716 0.001402 -0.023544
N  1.900856 1.028199 -0.608143
C  -3.112678 -0.01107 -0.052481
C  -0.233016 -0.037994 -0.112896
C  -2.367615 1.115168 -0.543055
C  -2.36823 -1.14931 0.406705
C  -0.970919 1.096286 -0.569895
C  -0.968328 -1.154435 0.3739
C  1.22954 0.014639 -0.171878
C  -5.242553 1.179399 -0.504528
C  -5.243242 -1.161666 0.489516
C  3.808626 -1.090446 0.226431
C  3.317767 1.20583 -0.717601
C  4.201777 0.116418 -0.282628
H  -2.887904 2.006606 -0.902782
H  -2.888542 -2.030877 0.789559
H  -0.408401 1.957095 -0.94457
H  -0.44502 -2.046764 0.736133
H  -4.99397 2.085847 0.082059
H  -6.323599 0.997165 -0.406178
H  -5.027067 1.388861 -1.570857
H  -6.324009 -0.961158 0.433047
H  -4.990331 -1.372577 1.547638
H  -5.033927 -2.073953 -0.10373
H  5.274138 0.308273 -0.383439
H  4.368357 -2.857702 0.956058
