program: Gaussian 09
title: 000145279
version: EM64L-G09RevD.01
frameworkgroup: C1[X(C10H10O2)]
method: RPBEPBE
basis: SDD
operation: Freq
keyword: #pfreq=noraman
keyword: PBEPBE/SDD
title: #p freq=noraman PBEPBE/SDD
converged: YES YES NO NO
title: Mulliken charges:
elementType: O O C C C C C C C C C C H H H H H H H H H H
charge: -0.175665 -0.179847 -0.225435 -0.203326 -0.465875 -0.456870 0.151849 0.134656 -0.020706 -0.025587 -0.519018 -0.516682 0.273413 0.271129 0.230111 0.254404 0.228231 0.249349 0.249123 0.248806 0.248702 0.249238
chargesum: 0.00000
title: Mulliken charges with hydrogens summed into heavy atoms:
elementType: O O C C C C C C C C C C
charge: -0.175665 -0.179847 0.047978 0.067802 0.018640 0.020710 0.151849 0.134656 -0.020706 -0.025587 -0.021089 -0.018742
polarizability: 1.20184606e+02 -3.96295241e+00 1.30668759e+02 -1.91497602e+00 -8.26328151e-01 7.12633112e+01
1716.lowfreq: -0.0248 -0.0003 -0.0002 2.9196 8.3304 11.1756 45.1414 80.3643 140.9022
frequency: 45.1180 80.2940 140.9020 149.9734 225.6069 250.6428 261.0657 329.3375 374.8251 415.9858 482.4553 539.2459 563.6975 662.1473 686.4785 727.0752 733.9465 786.2044 804.6320 874.6211 878.2216 917.5510 946.8338 965.2689 981.2268 996.2286 1017.7075 1042.1579 1057.5461 1089.3639 1112.6150 1121.9675 1156.8405 1178.6552 1188.6406 1203.6603 1206.0935 1235.5011 1242.7980 1253.6935 1295.2086 1325.6608 1361.5198 1430.9853 1439.8974 1461.4991 1472.8343 1562.6359 1577.0553 1622.5793 3019.6538 3022.8856 3027.1975 3029.9770 3036.4899 3046.5691 3085.3171 3098.8201 3100.4062 3116.8758
redmass: 6.7444 2.5282 2.4130 3.8107 2.9023 4.4812 3.7941 8.9657 3.0819 8.2265 5.9547 3.6797 4.9228 2.7913 3.8424 3.5649 1.7617 1.5170 2.0622 2.5985 2.5408 3.0133 2.2613 2.6632 5.3651 2.2297 2.3524 1.4106 1.4369 2.2463 3.1366 1.1625 1.3860 1.3928 1.4172 1.3156 1.4204 1.3655 1.4806 1.3964 1.6034 6.1838 6.4113 1.1068 1.1298 1.0848 1.1070 11.1475 11.5859 9.7166 1.0816 1.0573 1.0590 1.0623 1.0661 1.0856 1.1062 1.1069 1.1043 1.1071
irintensity: 10.6628 0.3756 0.0304 0.2215 0.4251 1.8435 4.1430 17.0781 0.2580 1.1966 2.0976 0.4875 0.3740 7.8891 4.1143 0.7949 7.4942 1.8471 0.4139 2.5120 1.0899 23.4717 9.6024 25.5435 2.8428 6.6267 3.1530 20.3646 13.6395 11.1939 24.5388 0.2358 5.1330 8.1336 5.7962 15.6081 18.8840 2.1927 2.8639 10.5648 0.8053 42.8064 19.2691 11.9493 25.2202 10.5113 6.8972 13.6578 338.1713 42.3105 14.1564 9.7756 25.0291 17.3835 29.2700 10.5554 0.0193 7.8315 20.0736 37.0993
temp: 298.150 k
press: 1.00000 atm
elementType: 8 8 6 6 6 6 6 6 6 6 6 6 1 1 1 1 1 1 1 1 1 1
symmnumber: 1
zpe: 454945.2 jmol-1
zpe.correction: 0.173279 hartree
zpe.thermalcorrener: 0.183444 hartree
zpe.thermalcorrenthalpy: 0.184389 hartree
zpe.thermalcorrgfe: 0.137045 hartree
zpe.sumelectzpe: -536.564876 hartree
zpe.sumelectthermal: -536.554711 hartree
zpe.sumelectthermalent: -536.553767 hartree
zpe.sumelectthermalfe: -536.601110 hartree
dipole: -0.2546 -0.1443 0.3227
dipole: 0.4356
quadrupole: -58.2151 -92.5728 -65.9883
quadrupole: 5.7384 -1.5042 0.5061
quadrupole: 14.0436 -20.3141 6.2705 5.7384 -1.5042 0.5061
hfenergy: -536.7381553 hartree
pointgroup: C01 [X(C10H10O2)]
dipole: 0.0968395 -0.063718 -0.1262319 debye
dipolederiv: -0.5273591 -0.0701488 -0.0112696 -0.1355725 -0.9898683 -0.0671727 0.0392696 -0.0023849 -0.315569 -0.5281634 -0.1237421 0.0309565 -0.0542454 -0.9750341 0.0438806 0.0430524 -0.0207451 -0.3269047 -0.4137057 -0.1465048 -0.0960513 -0.0248114 -0.0239547 0.0178777 -0.1937059 0.0456325 0.0061876 -0.392884 0.2084113 -0.0284 0.0899043 -0.0984801 -0.069986 -0.0168182 -0.0487969 0.0649938 0.1444355 -0.0731956 -0.0097237 -0.0286461 0.0493746 0.0410332 0.1349042 -0.0166286 0.0970031 0.1550386 -0.0176765 -0.0280982 -0.0369767 0.0669366 0.0569456 0.0553291 0.0241219 0.0981944 0.1489699 0.3238093 -0.0466989 0.450416 -0.3573541 -0.0830147 -0.0018819 -0.0677209 -0.0214826 -0.2250502 -0.3981194 0.0316379 -0.5128507 -0.0284915 0.088543 0.0427259 0.0897182 -0.0382067 0.8629869 -0.182727 0.0097921 0.0274657 1.2143654 0.0956305 -0.1081305 0.0487294 0.1324611 0.9682516 0.3067618 -0.1245874 0.0670002 1.0705573 -0.0223861 -0.2114859 0.0201841 0.1799279 -0.1695369 -0.0228876 0.0541064 -0.0421059 -0.093457 0.0080267 0.0487753 0.0051701 0.1236084 -0.1251636 0.0345906 0.0476491 0.0568706 -0.1276604 -0.0179304 0.0581754 -0.0290287 0.1261406 0.0199203 0.0419144 0.0601207 0.0260531 -0.0037709 -0.0693837 0.0679226 -0.0682772 -0.0012184 0.0804347 -0.009606 0.0384753 0.0112577 0.023165 0.0457725 0.034486 0.0574375 -0.0680996 0.0066741 -0.0111333 0.1200951 0.0068584 0.0479637 -0.0234305 0.0698802 -0.0044501 -0.0691766 -0.0377491 0.1006337 -0.056215 0.0982429 -0.0578208 0.0526743 -0.0589063 0.0313919 0.0600988 -0.1479998 0.0003284 0.0638561 0.0362118 0.0636022 -0.0084583 0.0801115 0.010138 0.028095 0.0655524 0.0100908 0.0003969 -0.068632 -0.046144 -0.093155 -0.0439734 -0.0785667 -0.0063487 0.0511977 -0.0296519 0.0487599 -0.0063774 0.0797311 0.0573619 0.0895279 0.0677016 -0.0504677 -0.0212782 -0.0492464 -0.0723569 -0.022807 0.0849586 -0.0457452 -0.1004801 -0.0456114 0.0146357 0.0172617 0.0735194 -0.0516111 0.049924 0.0457732 0.0691612 -0.0801253 0.081365 0.0081648 0.068166 0.0345777 0.0191661 0.0128205 0.0556084 -0.0762447 0.0513474 -0.0993794 -0.0420373 unknown
polarizability: 120.5087594|4.3456289|130.3276409|-2.3005946|-0.4160744|71.2802758 unknown
InChI: InChI=1S/C10H10O2/c11-9-5-1-2-6(5)10(12)8-4-3-7(8)9/h5-6H,1-4H2
charge 0 multiplicity 1
22 atoms
O  0.558483 2.809154 0.2006
O  -0.579337 -2.713679 0.219075
C  -1.165267 1.07007 0.408097
C  -1.453199 -0.463871 0.66594
C  -2.05831 0.976114 -0.899789
C  -2.622867 -0.391685 -0.39101
C  1.237312 0.493957 0.003181
C  0.961819 -0.859987 0.044886
C  0.260983 1.576309 0.212849
C  -0.352586 -1.468534 0.298371
C  2.721474 0.292183 -0.315083
C  2.40179 -1.271983 -0.276798
H  -1.666221 1.705811 1.158973
H  -1.783482 -0.702862 1.693226
H  -1.445916 0.866662 -1.811568
H  -2.772656 1.80033 -1.045691
H  -3.60826 -0.291652 0.093715
H  -2.661577 -1.222295 -1.112819
H  3.050944 0.680458 -1.293803
H  3.421596 0.645648 0.460599
H  2.91949 -1.838279 0.515779
H  2.536388 -1.80017 -1.23593
