program: Gaussian 09
title: 000145255
version: EM64L-G09RevD.01
frameworkgroup: C1[X(C12H11ClO)]
method: RPBEPBE
basis: SDD
operation: Freq
keyword: #p
keyword: freq=noraman
keyword: PBEPBE/SDD
title: #p freq=noraman PBEPBE/SDD
converged: NO YES NO NO
title: Mulliken charges:
elementType: Cl O C C C C C C C C C C C C H H H H H H H H H H H
charge: -0.053015 -0.157293 -0.241469 -0.236469 -0.219370 -0.221982 -0.425703 -0.326427 -0.420064 -0.332050 -0.496035 0.759601 0.109562 -0.759906 0.273373 0.277282 0.273307 0.270990 0.282207 0.292869 0.306730 0.297479 0.236739 0.230786 0.278857
chargesum: 0.00000
title: Mulliken charges with hydrogens summed into heavy atoms:
elementType: Cl O C C C C C C C C C C C C
charge: -0.053015 -0.157293 0.031904 0.040813 0.053936 0.049008 -0.143496 -0.033558 -0.113334 -0.034570 -0.028510 0.759601 0.109562 -0.481049
polarizability: 1.48672597e+02 3.92458218e+00 1.12348883e+02 -2.24101576e+00 2.59988700e+00 1.07173480e+02
1716.lowfreq: -20.1791 -14.3601 -6.2141 -0.0026 -0.0016 -0.0010 56.7487 115.7845 127.5016
frequency: 56.7302 115.7818 127.4852 230.6238 280.0049 337.6905 405.1137 430.6408 476.2036 488.0146 533.1327 575.2407 607.9304 649.0917 719.7565 728.2636 746.6026 766.8156 789.4969 802.2984 818.6533 819.9967 857.3351 860.1599 899.6837 907.7630 913.0116 939.3506 945.7968 955.0894 964.7899 983.3844 993.3061 1045.7739 1068.8890 1092.1389 1102.8064 1113.1774 1140.6560 1146.3368 1163.1420 1180.5422 1192.4629 1200.0207 1212.2142 1214.2210 1232.9231 1244.2091 1254.4947 1260.7103 1263.1216 1271.1044 1277.6114 1294.2073 1298.4388 1474.4637 1670.7072 1684.1940 3008.2339 3065.4892 3072.8720 3074.7820 3076.1178 3084.2659 3086.4064 3093.4097 3102.3084 3113.8709 3189.1126
redmass: 10.4948 7.3423 7.1445 3.8980 6.7846 4.1577 2.3509 4.4827 4.6027 6.6486 5.0944 4.7612 6.2339 5.3307 6.4198 4.7621 4.2823 3.8553 1.6392 3.1367 2.3314 2.6382 2.5656 2.0971 2.5097 3.4994 2.5261 2.0320 1.7633 2.1360 2.7419 2.1083 1.4959 1.3901 1.9377 2.4326 1.0901 2.0615 1.9295 1.9311 1.7044 1.4902 1.4247 1.4344 1.8809 1.7501 1.3975 1.4285 1.5034 1.4399 1.5891 1.7402 1.6272 1.6791 1.6440 1.0993 11.2171 9.2391 1.0599 1.0883 1.0905 1.1030 1.0895 1.0891 1.0907 1.0915 1.0912 1.0950 1.0962
irintensity: 0.9703 0.3474 1.8453 1.5025 1.4260 2.5916 2.2396 0.8066 3.2721 0.8938 1.9287 3.7501 1.7821 5.1984 57.7862 8.6522 0.7537 1.4519 36.0437 9.7137 16.1335 0.8956 8.2379 2.9932 0.3309 3.3160 3.5060 3.3852 0.9053 4.4277 2.6130 3.4692 0.9107 3.3132 20.5035 4.0752 1.7456 8.8929 6.3439 0.0917 0.3966 9.0354 1.4473 2.8232 9.0215 1.4263 1.5620 4.5669 0.7214 0.5646 3.8061 0.3075 0.0700 4.9793 25.0217 10.9156 232.3362 25.6026 39.0715 5.5332 5.5255 22.3245 13.7293 14.1206 41.6965 57.2904 27.3650 23.4242 4.8034
temp: 298.150 k
press: 1.00000 atm
elementType: 17 8 6 6 6 6 6 6 6 6 6 6 6 6 1 1 1 1 1 1 1 1 1 1 1
symmnumber: 1
zpe: 519123.5 jmol-1
zpe.correction: 0.197724 hartree
zpe.thermalcorrener: 0.207466 hartree
zpe.thermalcorrenthalpy: 0.208410 hartree
zpe.thermalcorrgfe: 0.161833 hartree
zpe.sumelectzpe: -998.109225 hartree
zpe.sumelectthermal: -998.099483 hartree
zpe.sumelectthermalent: -998.098539 hartree
zpe.sumelectthermalfe: -998.145115 hartree
dipole: -3.0745 -3.2796 1.8402
dipole: 4.8575
quadrupole: -89.5334 -98.2586 -81.7013
quadrupole: 1.5439 1.8583 5.1379
quadrupole: 0.2977 -8.4275 8.1298 1.5439 1.8583 5.1379
hfenergy: -998.3069486 hartree
pointgroup: C01 [X(C12H11Cl1O1)]
dipole: 1.1923022 -1.3532858 -0.6318665 debye
dipolederiv: -0.6127446 -0.0385685 0.181017 -0.0807925 -0.0779201 0.0569879 0.5425704 0.0674364 -0.377702 -0.2397204 0.2390269 0.0490109 0.0918255 -1.0588029 -0.0762687 0.0136573 -0.1053671 -0.4127941 -0.0212395 -0.0587315 -0.0439298 -0.0405458 0.087196 0.0819735 0.0156134 0.0739162 0.0517152 0.1387761 0.0142396 -0.0493647 -0.0483514 -0.0134911 0.0216423 -0.056273 -0.0376701 0.0141242 0.0154077 0.0373286 0.0079537 -0.0138636 0.0972358 -0.0131583 -0.0389387 -0.0066035 -0.0026385 0.1029056 -0.0098296 0.0508595 0.0228199 0.0676987 0.016698 0.0170982 0.0573941 0.0144115 0.0960051 0.063309 0.0886978 0.0763846 0.085431 0.058756 -0.1316773 0.0176368 0.1358068 -0.0707466 0.0475843 0.0338879 0.0337313 -0.1802905 -0.2170711 0.0138318 -0.233973 -0.2118432 0.0609447 0.0977541 -0.0805845 0.0354548 0.1281878 -0.0198571 0.0465253 0.013895 -0.0172744 -0.0379674 0.07345 -0.0034912 0.0644765 -0.3442289 0.1847933 -0.0036231 0.2437269 -0.0286731 0.0115869 -0.0252183 -0.0648976 -0.0051589 0.0010583 0.0207218 -0.0425608 0.0136345 0.1057718 -0.075011 -0.018556 0.1082793 -0.0121749 -0.0879591 -0.0250697 0.2060435 -0.0305103 -0.0348052 0.0386164 -0.378231 -0.1139817 -0.1134382 1.2698077 0.0508974 -0.01335 0.0628048 0.6873721 0.7003251 0.0409606 -0.3549516 0.0707972 -0.2062736 -0.1209209 -0.6966406 -0.1271929 0.446746 0.0228854 0.0454218 0.045594 0.0557832 -0.0509254 -0.1110615 0.0369077 -0.1067303 -0.0417861 -0.1325318 -0.0075925 0.1010052 -0.0045636 0.0572215 -0.001126 0.0858285 0.0109411 0.0145979 0.0329526 -0.0896166 0.0027872 -0.0697436 -0.1273662 0.0074199 -0.0058212 -0.0087324 0.0631753 -0.0931966 -0.0789821 -0.0705262 -0.0915237 0.0051629 -0.0495358 -0.0660736 -0.0357261 0.0352943 0.0080173 -0.0115901 -0.1016163 -0.001779 0.0486877 -0.0043275 -0.056577 -0.0016544 -0.1076238 0.0339546 -0.0060718 0.0223793 -0.0405852 -0.02384 0.0980584 0.0165473 0.0903997 -0.0356561 0.0146138 -0.0442102 0.0717743 -0.0144633 0.0367571 0.0282973 0.040542 0.0249858 -0.0367659 0.0326615 0.0056889 0.0157445 -0.0237959 0.0364155 -0.0520868 -0.0039702 -0.052585 -0.0965506 0.0821015 -0.0111871 0.038051 0.0048112 0.0663941 0.030925 -0.0348234 0.083637 -0.1607946 -0.0976033 0.1104886 0.0252973 0.0944121 -0.0193697 -0.0175755 0.0771761 -0.0665122 0.059733 -0.0109928 0.003133 0.0410047 0.0102835 0.2032135 0.0508881 0.0379876 0.0528492 -0.0638406 unknown
polarizability: 148.1728991|-3.4452279|111.1759325|-5.5613826|-2.9968708|108.8461286 unknown
InChI: InChI=1S/C12H11ClO/c13-2-5-6-3-1-4-8-7(3)9(5)11(8)12(14)10(4)6/h2-4,6-11H,1H2
charge 0 multiplicity 1
25 atoms
Cl -3.795648 -0.405799 0.878322
O  -0.032809 2.865099 0.328434
C  0.847038 -1.198124 -1.127556
C  1.832913 -0.002005 -0.820524
C  0.509881 -1.75545 0.297183
C  1.933653 -0.025814 0.751902
C  -0.293791 -0.16797 -1.515583
C  0.718777 1.042886 -1.211546
C  -0.467031 -0.643827 0.831511
C  0.543418 0.571736 1.157595
C  1.818181 -1.531369 1.091622
C  -1.304741 -0.310032 -0.390262
C  0.337144 1.686804 0.122483
C  -2.639911 -0.198324 -0.519944
H  1.142832 -1.947912 -1.875339
H  2.794846 0.040195 -1.351035
H  0.078773 -2.768197 0.31617
H  2.796078 0.515417 1.171095
H  -0.699557 -0.186637 -2.536989
H  0.888529 1.75093 -2.033355
H  -1.05388 -0.929309 1.716621
H  0.456551 0.922817 2.195597
H  1.710802 -1.726498 2.173413
H  2.666532 -2.124242 0.703337
H  -3.17048 0.021624 -1.448352
