program: Gaussian 09
title: 000145246
version: EM64L-G09RevD.01
frameworkgroup: C1[X(C15H9Cl2N)]
method: RPBEPBE
basis: SDD
operation: Freq
keyword: #p
keyword: freq=noraman
keyword: PBEPBE/SDD
title: #p freq=noraman PBEPBE/SDD
converged: YES YES NO NO
title: Mulliken charges:
elementType: Cl Cl N C C C C C C C C C C C C C C C H H H H H H H H H
charge: -0.062853 -0.044573 -0.025080 0.369147 0.562079 0.265780 -0.333454 -0.348738 -0.374737 -0.336011 -0.313068 -0.218642 -0.220718 -0.249296 -0.264636 -0.116402 -0.222460 -0.313072 0.232455 0.257547 0.235896 0.256787 0.259971 0.258990 0.261660 0.241114 0.242315
chargesum: 0.00000
title: Mulliken charges with hydrogens summed into heavy atoms:
elementType: Cl Cl N C C C C C C C C C C C C C C C
charge: -0.062853 -0.044573 -0.025080 0.369147 0.562079 0.265780 -0.100999 -0.091191 -0.138841 -0.336011 -0.056281 0.041329 0.038272 0.012364 -0.023522 -0.116402 0.019854 -0.313072
polarizability: 3.81625842e+02 2.55069155e+00 2.03314471e+02 3.87907713e+00 -5.05324116e+00 7.20750252e+01
1716.lowfreq: -4.6124 -0.0014 -0.0013 -0.0008 0.1222 4.7974 15.1145 31.4117 49.2084
frequency: 15.0049 31.3681 49.2016 59.2910 96.0395 145.2705 147.2210 174.1016 191.6229 224.4099 260.5721 308.2480 332.5743 341.4943 372.7894 404.5889 407.0355 421.1966 448.1479 488.3003 524.8513 534.9025 589.7539 625.6760 653.2541 664.4095 707.1692 715.2648 728.0944 765.7469 768.5600 820.6820 829.9264 839.3990 871.7715 933.6504 955.2053 959.2269 968.3774 986.5320 995.3318 1002.6517 1011.9745 1047.0478 1078.8636 1122.8545 1128.3125 1175.8022 1199.7463 1217.7159 1260.4758 1293.3726 1307.8330 1340.1377 1366.8040 1395.4638 1407.6269 1428.7535 1456.9588 1482.7896 1559.6114 1573.6778 1588.0624 1601.2189 1602.8326 2154.6595 3141.8302 3144.8167 3146.7646 3148.2355 3161.7739 3173.0691 3176.3538 3178.0059 3195.5398
redmass: 6.9628 4.9707 6.5453 9.3694 6.0288 10.0910 7.4207 8.1043 8.5051 7.4269 8.1005 3.7752 7.7436 7.6730 6.5551 8.0923 2.9796 7.5262 3.2154 3.4371 7.8449 3.4099 6.9416 7.1954 5.5974 7.1870 7.4855 3.3234 3.2210 1.8500 2.6423 1.8810 1.9662 1.7845 1.3724 1.4861 1.3592 1.4000 1.3743 6.0726 1.3557 3.5535 7.1025 2.0762 2.7065 1.4364 1.7585 1.1114 1.1536 1.7112 3.8051 1.6412 1.3923 2.3998 6.5032 2.7034 2.7036 2.3439 2.4050 2.3775 5.4670 6.4861 5.7495 6.8492 6.4330 12.6329 1.0881 1.0867 1.0893 1.0871 1.0924 1.0956 1.0967 1.0977 1.0943
irintensity: 2.0313 0.4558 1.2483 0.3400 0.7834 5.3437 0.4805 0.6583 0.3522 1.1164 0.2785 0.1671 6.4244 5.7730 3.4822 6.2608 0.8968 8.8640 5.5815 22.1068 6.6801 11.8252 10.8457 0.3898 1.6424 20.6558 15.8012 0.7827 13.1661 42.8809 28.3559 10.1965 4.3345 63.4404 0.0160 12.4486 0.0584 4.3699 0.5199 37.9016 0.0214 15.2759 51.1389 3.8349 70.3417 8.6862 1.1445 4.1963 0.9780 1.8595 18.2353 2.4412 1.8096 24.4737 0.9363 24.4828 8.1638 31.2743 8.1564 91.0585 3.0331 3.6947 8.2999 10.5473 32.0782 30.4704 22.7077 1.1476 2.5674 0.5111 10.7261 3.8566 2.2872 10.4807 6.7733
temp: 298.150 k
press: 1.00000 atm
elementType: 17 17 7 6 6 6 6 6 6 6 6 6 6 6 6 6 6 6 1 1 1 1 1 1 1 1 1
symmnumber: 1
zpe: 500205.9 jmol-1
zpe.correction: 0.190518 hartree
zpe.thermalcorrener: 0.206221 hartree
zpe.thermalcorrenthalpy: 0.207165 hartree
zpe.thermalcorrgfe: 0.144420 hartree
zpe.sumelectzpe: -1550.622858 hartree
zpe.sumelectthermal: -1550.607155 hartree
zpe.sumelectthermalent: -1550.606211 hartree
zpe.sumelectthermalfe: -1550.668956 hartree
dipole: 2.8378 -1.5234 0.1512
dipole: 3.2244
quadrupole: -104.1341 -124.2934 -122.3076
quadrupole: -0.2747 1.2832 -2.5660
quadrupole: 12.7776 -7.3817 -5.3959 -0.2747 1.2832 -2.5660
hfenergy: -1550.8133761 hartree
pointgroup: C01 [X(C15H9Cl2N1)]
dipole: 1.098545 -0.6166675 -0.1490769 debye
polarizability: 381.6515701|-2.3625006|194.681798|-2.4445807|32.9577396|80.6819698 unknown
InChI: InChI=1S/C15H9Cl2N/c16-14-7-5-11(6-8-14)13(10-18)9-12-3-1-2-4-15(12)17/h1-9H
charge 0 multiplicity 1
27 atoms
Cl 2.224674 -2.716787 -1.293309
Cl -6.250213 -0.729547 -0.322603
N  0.152703 3.188142 0.813285
C  -1.733608 0.342354 -0.038071
C  2.178137 -0.06728 -0.254692
C  -0.285808 0.704428 0.039898
C  0.720385 -0.187999 -0.289441
C  -2.727923 1.360578 -0.063025
C  -2.164496 -1.014573 -0.081102
C  2.99183 -1.162877 -0.687553
C  2.889128 1.090176 0.198572
C  -4.099459 1.046215 -0.15226
C  -3.530417 -1.344065 -0.17158
C  4.395896 -1.130302 -0.680145
C  4.294029 1.141704 0.213238
C  -4.483714 -0.306289 -0.210616
C  5.055503 0.033587 -0.225764
C  -0.015437 2.055619 0.462157
H  0.375767 -1.162515 -0.652332
H  -2.431014 2.413895 -0.019434
H  -1.440442 -1.832886 -0.01569
H  2.32763 1.960032 0.544094
H  -4.851404 1.83983 -0.176157
H  -3.850067 -2.389553 -0.197219
H  4.963807 -1.999148 -1.02371
H  4.79582 2.047405 0.568181
H  6.149692 0.067556 -0.217022
