program: Gaussian 09
title: 000145224
version: EM64L-G09RevD.01
frameworkgroup: C1[X(C20H35N)]
method: RPBEPBE
basis: SDD
operation: Freq
keyword: #pfreq=noraman
keyword: PBEPBE/SDD
title: #p freq=noraman PBEPBE/SDD
converged: YES YES NO NO
title: Mulliken charges:
elementType: N C C C C C C C C C C C C C C C C C C C C H H H H H H H H H H H H H H H H H H H H H H H H H H H H H H H H H H H
charge: -0.698738 -0.385730 -0.386456 -0.386178 -0.384624 -0.384385 -0.389186 -0.382223 -0.366062 -0.372533 -0.386143 -0.353493 -0.573544 -0.356562 0.523846 -0.696925 -0.400293 -0.417563 -0.417965 -0.414256 0.478673 0.193225 0.193038 0.193409 0.193675 0.193225 0.193325 0.193174 0.192815 0.192587 0.192686 0.195148 0.194171 0.191734 0.191684 0.190336 0.191926 0.189071 0.189146 0.206312 0.208379 0.187473 0.187508 0.200746 0.201891 0.194647 0.194621 0.209566 0.214682 0.209588 0.224685 0.225279 0.209867 0.209940 0.300397 0.300384
chargesum: 0.00000
title: Mulliken charges with hydrogens summed into heavy atoms:
elementType: N C C C C C C C C C C C C C C C C C C C C
charge: -0.097957 0.000533 0.000627 0.000372 0.001366 0.000888 0.000133 0.001196 0.016201 0.005685 0.028548 0.021487 -0.170907 0.032705 0.523846 -0.063089 -0.175608 -0.192284 -0.208098 -0.204315 0.478673
polarizability: 3.16535886e+02 2.81578068e+01 1.79907976e+02 7.59754878e+00 -6.74540548e+00 1.91201217e+02
1716.lowfreq: -41.3308 -22.8093 -3.6920 -0.0023 0.0011 0.0012 0.4056 4.5676 14.1297
frequency: -33.8961 -16.0467 13.9704 14.9693 27.8233 33.5535 37.7430 63.6609 69.8359 71.4096 98.0683 103.5133 119.3608 119.9171 128.0906 130.0700 147.7040 149.2846 173.1189 215.3951 231.6787 252.6165 290.3218 298.1780 309.2052 346.1784 354.3762 370.5888 391.7344 408.6951 424.1985 438.5022 482.6983 496.8864 507.9513 550.6504 639.5430 717.1792 717.9068 720.6174 724.8228 726.5162 737.4181 756.1076 770.5948 784.7007 814.6143 820.3265 822.1779 834.1691 863.9910 886.7746 909.3029 932.1467 949.8650 954.4643 972.9740 982.8016 994.8713 997.9625 1001.1735 1013.0909 1016.7354 1031.0786 1037.2837 1045.2170 1064.6955 1075.3476 1077.7138 1078.5688 1081.0213 1081.3944 1088.0772 1123.2597 1133.9659 1179.0534 1186.9160 1193.7930 1194.8081 1215.6509 1218.0580 1220.3659 1237.9273 1242.6568 1258.0350 1264.6008 1274.0090 1276.1619 1280.8969 1284.4153 1286.2985 1289.1677 1291.2683 1295.8359 1296.5319 1306.3128 1309.4257 1319.5037 1324.3725 1337.1953 1346.4882 1351.3819 1351.7185 1354.7836 1355.2082 1384.2912 1385.6881 1432.1793 1457.1225 1457.2496 1459.4584 1459.7211 1462.0369 1462.5352 1464.5000 1468.0195 1472.2734 1476.3435 1476.7433 1480.6157 1484.0350 1486.3776 1487.5152 1518.8995 1582.4579 1632.3211 1643.9249 2946.4187 2946.9562 2947.3568 2948.4808 2949.2196 2949.9962 2951.9231 2955.3831 2959.2359 2962.3191 2963.4316 2966.8695 2970.2059 2972.0125 2979.5980 2981.1160 2983.5622 2987.2078 2992.3754 2999.0599 3005.7767 3011.4426 3019.1491 3027.4066 3034.8829 3040.8509 3044.7672 3066.7120 3069.4709 3103.2109 3105.4613 3125.9523 3133.2791 3569.9575 3710.6535
redmass: 1.7212 2.5110 4.0788 3.7380 2.4726 2.6194 4.2177 2.5672 2.5286 2.5755 2.3763 1.8283 4.4435 4.2361 2.2367 1.8724 2.0555 2.0171 3.7368 3.9072 1.1059 3.6862 2.5839 2.4869 1.4436 3.3891 1.0454 4.2880 2.5277 2.6958 3.1476 3.6252 3.2172 3.1007 3.1469 2.7435 6.6092 1.0571 1.0632 1.0729 3.3050 1.0896 1.1133 1.1517 3.8220 1.1962 1.2591 1.6553 1.4731 3.9612 1.2501 1.9035 1.2481 1.4198 1.3547 1.2293 5.2361 5.1291 1.2671 3.2979 3.0015 1.3800 4.0533 1.0794 3.4042 3.3460 2.8331 2.5361 1.6238 1.5203 2.2106 2.1508 2.8095 2.9665 1.1963 1.9388 1.0953 1.4057 1.4648 1.5041 1.5755 1.7598 1.3923 1.3307 1.3122 1.3228 1.2244 1.0194 1.0457 1.1128 1.3218 1.1170 1.1007 1.1167 1.1113 1.4377 2.7514 1.2546 1.4155 1.4532 1.5302 1.7214 1.6382 1.6437 1.6423 5.4732 1.2170 3.1941 1.0740 1.0740 1.0717 1.0726 1.0672 1.0686 1.0819 1.0882 1.0892 1.0621 1.0704 1.0922 1.0944 1.0969 1.0907 3.1194 6.6608 1.8061 2.1567 1.0585 1.0584 1.0585 1.0586 1.0592 1.0591 1.0594 1.0593 1.0589 1.0587 1.0585 1.0585 1.0364 1.0593 1.0959 1.0965 1.0975 1.0989 1.1005 1.1019 1.1023 1.1036 1.1049 1.1052 1.1050 1.1047 1.1046 1.1007 1.0993 1.0865 1.0865 1.0962 1.0971 1.0447 1.1040
irintensity: 0.0458 0.0533 0.1009 0.0691 0.0128 0.1052 0.3247 0.0266 0.3926 0.3564 0.0125 0.0259 1.7858 0.0239 0.0087 0.0247 0.0044 0.0022 1.9076 0.8325 0.0008 0.2939 3.2590 41.9265 275.9592 0.2407 0.8285 2.5629 1.2270 0.0278 0.0059 0.2511 1.9260 0.5281 8.9659 19.4460 0.2118 22.3300 0.4582 6.0545 0.3933 0.0021 2.4050 0.0996 8.6677 0.7411 0.0229 39.0160 20.8955 15.5780 0.5016 4.9752 0.2562 0.1575 0.0706 0.2232 0.1356 0.3846 0.1119 0.0991 0.2024 0.1903 0.0196 0.0222 1.3901 1.3639 0.0872 0.3938 0.5716 0.5008 0.3472 0.0191 1.9515 15.6129 19.5522 0.2985 17.5854 17.9954 13.0787 0.4341 0.0637 0.5048 0.2860 0.9561 0.2399 0.0654 0.3836 0.1260 0.0149 0.0362 0.2493 0.1511 0.2210 0.0169 0.0475 8.0008 60.9456 0.5646 2.5292 1.0583 0.3632 0.0828 0.6734 0.0198 0.1991 9.7162 11.1142 0.3417 0.0093 0.0045 0.0678 0.0057 0.0357 0.0606 0.1024 0.1942 0.9022 7.2834 5.2368 1.3655 0.1777 11.7091 42.2754 151.0217 3.3271 3.1588 265.9721 2.0512 0.1829 0.8517 0.3431 1.9185 0.2362 0.0284 6.8984 1.2776 62.3738 82.0907 196.6949 38.3494 143.7990 0.1189 0.2903 0.4068 0.4995 0.4352 0.5495 1.3176 0.1011 0.3346 4.7470 2.7150 114.8066 316.9081 100.4038 56.0835 4.5499 39.8765 55.6524 2.8233 65.1401 18.5213
temp: 298.150 k
press: 1.00000 atm
elementType: 7 6 6 6 6 6 6 6 6 6 6 6 6 6 6 6 6 6 6 6 6 1 1 1 1 1 1 1 1 1 1 1 1 1 1 1 1 1 1 1 1 1 1 1 1 1 1 1 1 1 1 1 1 1 1 1
symmnumber: 1
zpe: 1323137.2 jmol-1
zpe.correction: 0.503956 hartree
zpe.thermalcorrener: 0.528346 hartree
zpe.thermalcorrenthalpy: 0.529290 hartree
zpe.thermalcorrgfe: 0.445463 hartree
zpe.sumelectzpe: -836.213331 hartree
zpe.sumelectthermal: -836.188941 hartree
zpe.sumelectthermalent: -836.187997 hartree
zpe.sumelectthermalfe: -836.271824 hartree
dipole: 1.5197 0.9286 0.1575
dipole: 1.7879
quadrupole: -105.9986 -134.4888 -126.3081
quadrupole: 15.3374 3.2520 -2.6906
quadrupole: 16.2666 -12.2237 -4.0429 15.3374 3.2520 -2.6906
hfenergy: -836.717287 hartree
pointgroup: C01 [X(C20H35N1)]
dipole: 0.5980948 0.3701346 0.0086646 debye
polarizability: 316.5603958|28.8922764|178.1653205|3.554281|-4.7897631|192.9193618 unknown
InChI: InChI=1S/C20H35N/c1-2-3-4-5-6-7-8-9-10-11-12-13-14-19-15-17-20(21)18-16-19/h15-18H,2-14,21H2,1H3
charge 0 multiplicity 1
56 atoms
N  9.632129 1.569184 0.04218
C  -3.131918 -0.6440 -0.000455
C  -1.776773 0.098718 0.015627
C  -4.352435 0.303682 0.010634
C  -0.558035 -0.851157 -0.002061
C  -5.706403 -0.441212 -0.002885
C  0.798645 -0.11115 0.018496
C  -6.928184 0.504906 0.00489
C  2.014925 -1.063955 -0.011542
C  -8.281368 -0.241697 -0.007453
C  3.371736 -0.326163 0.014498
C  -9.504277 0.703043 -0.001021
C  4.588016 -1.292433 -0.035493
C  -10.856902 -0.045485 -0.013949
C  5.927271 -0.570425 -0.016098
C  -12.073225 0.905678 -0.007331
C  6.494546 -0.042204 -1.204902
C  6.639466 -0.360342 1.192397
C  7.713333 0.664807 -1.196829
C  7.860204 0.344366 1.223054
C  8.418966 0.871548 0.023722
H  -3.187321 -1.322789 0.876516
H  -3.181807 -1.294482 -0.898972
H  -1.722448 0.78055 -0.858995
H  -1.724349 0.745721 0.91643
H  -4.298343 0.980929 -0.867583
H  -4.30213 0.955629 0.908016
H  -0.614434 -1.535719 0.870347
H  -0.609454 -1.49549 -0.904934
H  -5.755333 -1.094938 -0.899092
H  -5.760893 -1.116983 0.876476
H  0.854753 0.526878 0.925273
H  0.852874 0.57903 -0.84941
H  -6.879295 1.159338 0.900542
H  -6.874515 1.17993 -0.875063
H  1.960472 -1.698634 -0.921452
H  1.958509 -1.758514 0.853248
H  -8.329606 -0.896832 -0.902703
H  -8.335087 -0.916189 0.872979
H  3.432241 0.374945 -0.842827
H  3.442973 0.296948 0.929078
H  -9.452296 1.377838 -0.881311
H  -9.458244 1.358134 0.894354
H  4.503032 -1.912958 -0.950751
H  4.520839 -1.988559 0.824456
H  -10.90762 -0.71967 0.86558
H  -10.901656 -0.699659 -0.908781
H  -12.060827 1.570086 -0.892151
H  -13.027123 0.346606 -0.017773
H  -12.067846 1.548772 0.893165
H  5.973749 -0.192617 -2.159698
H  6.232687 -0.7602 2.130368
H  8.127699 1.055543 -2.135081
H  8.388709 0.484887 2.174662
H  10.135025 1.715299 0.911888
H  10.030351 1.942962 -0.813583
